program: Orca
programVersion: 5.0.3
elementType: C H C H C C C H H C H H C C H H H H H H H
charge: 1
multiplicity: 1
keywords: PBE0 def2-TZVP EnGrad D3BJ RIJCOSX verytightscf def2/J soscf
formula: C8H13
InChI: InChI=1/C8H13/c1-2-4-6-8-7-5-3-1/h1-2,7H,3-6,8H2
21 atoms
C  -1.992658 0.518455 0.066205
H  -2.1986 0.793136 1.103992
C  -2.000152 -1.023477 -0.116059
H  -2.679226 -1.575313 0.534409
C  -0.542511 -1.084204 0.292673
C  0.570393 -1.057694 -0.529986
C  1.901372 -0.628049 0.011931
H  2.027072 -1.005262 1.032527
H  2.717128 -1.019914 -0.600718
C  1.936927 0.939082 0.02582
H  2.147005 1.304621 -0.985456
H  2.748021 1.285915 0.671146
C  0.567429 1.467891 0.492633
C  -0.490223 0.70709 -0.263989
H  0.463853 -1.274052 -1.591945
H  -2.159845 -1.321031 -1.155957
H  0.430131 1.368207 1.574741
H  -0.36265 0.802997 -1.345656
H  -2.646776 1.086313 -0.600321
H  0.469461 2.534391 0.247895
H  -0.361092 -1.025815 1.366453
totalener: -312.09127399 hartree
nucrepener: 387.55454735 hartree
electener: -699.64582134 hartree
oneelecener: -1175.91838705 hartree
twoeener: 476.27256571 hartree
kineticenergy: 310.19305110 hartree
exchangeener: -34.200820754215 hartree
correlationener: -1.979420114375 hartree
xcener: -36.180240868591 hartree
chargesum: 1.0000000
charge: -0.188903 0.163106 -0.189181 0.176157 -0.031047 -0.048210 -0.226466 0.163765 0.176315 -0.240644 0.155937 0.172754 -0.200439 -0.088905 0.205428 0.157761 0.145823 0.169595 0.173950 0.177255 0.175950
charge: -0.186849 0.158794 -0.185146 0.155211 -0.058277 -0.017152 -0.207675 0.162662 0.163776 -0.215409 0.152825 0.156545 -0.228970 -0.026049 0.170970 0.157688 0.155390 0.181657 0.154428 0.174534 0.181049
qa: -0.1889 0.1631 -0.1892 0.1762 -0.0310 -0.0482 -0.2265 0.1638 0.1763 -0.2406 0.1559 0.1728 -0.2004 -0.0889 0.2054 0.1578 0.1458 0.1696 0.1739 0.1773 0.1760
va: 3.9331 0.9751 3.9414 0.9709 3.9111 3.8453 3.9639 0.9653 0.9680 3.9602 0.9696 0.9673 3.9680 3.9158 0.9424 0.9737 0.9737 0.9627 0.9691 0.9660 0.9605
dispcorr: -0.017893155 hartree
energy: -312.109167145505
dipole: 0.55710 -0.70397 -0.14687 1.82922 -1.92006 -0.09083 0.23518 -0.40122 -0.16604
magnitude: 0.23957 au
magnitude: 0.60893 debye
