program: Orca
programVersion: 5.0.3
elementType: C H C H C C C H H C H H C C H H H H H H H
charge: 1
multiplicity: 1
keywords: m062x def2-TZVP EnGrad RIJCOSX verytightscf def2/J soscf
formula: C8H13
InChI: InChI=1/C8H13/c1-2-4-6-8-7-5-3-1/h1-2,7H,3-6,8H2
21 atoms
C  -1.999455 0.522228 0.115178
H  -2.181722 0.726231 1.173673
C  -1.980634 -1.006446 -0.163189
H  -2.678893 -1.602165 0.425957
C  -0.533323 -1.101191 0.274785
C  0.600479 -1.094806 -0.513122
C  1.904425 -0.640537 0.05714
H  1.998372 -0.955452 1.101847
H  2.749549 -1.045787 -0.505489
C  1.91509 0.926226 -0.021131
H  2.069005 1.233668 -1.061901
H  2.753908 1.319054 0.559361
C  0.566771 1.477881 0.483278
C  -0.522685 0.753976 -0.250775
H  0.521358 -1.286613 -1.582646
H  -2.109626 -1.230853 -1.225802
H  0.454952 1.380423 1.568323
H  -0.409457 0.828807 -1.335573
H  -2.687564 1.113198 -0.496069
H  0.49254 2.54825 0.240466
H  -0.378991 -1.053383 1.353654
totalener: -312.31893718 hartree
nucrepener: 386.75097793 hartree
electener: -699.06991510 hartree
oneelecener: -1174.09945291 hartree
twoeener: 475.02953780 hartree
kineticenergy: 310.41644705 hartree
xcener: -23.115182747737 hartree
chargesum: 1.0000000
charge: -0.257698 0.199768 -0.274980 0.200407 -0.081366 -0.017300 -0.330051 0.203054 0.204400 -0.304718 0.200167 0.199430 -0.289694 -0.097084 0.219167 0.195611 0.190964 0.221916 0.197927 0.211271 0.208808
charge: -0.192938 0.158325 -0.188083 0.154922 -0.067020 -0.016464 -0.210494 0.161684 0.164058 -0.214422 0.153139 0.156779 -0.230824 -0.003009 0.169755 0.157754 0.157130 0.177472 0.155451 0.178388 0.178398
qa: -0.2577 0.1998 -0.2750 0.2004 -0.0814 -0.0173 -0.3301 0.2031 0.2044 -0.3047 0.2002 0.1994 -0.2897 -0.0971 0.2192 0.1956 0.1910 0.2219 0.1979 0.2113 0.2088
va: 3.7410 0.9576 3.7543 0.9634 3.7106 3.5993 3.7703 0.9457 0.9582 3.7124 0.9476 0.9577 3.7363 3.5895 0.9428 0.9562 0.9539 0.9344 0.9617 0.9502 0.9449
energy: -312.318937176896
dipole: 0.55611 -0.68569 -0.12958 1.84908 -1.85013 -0.00105 0.20209 -0.37009 -0.16800
magnitude: 0.21217 au
magnitude: 0.53930 debye
