program: Orca
programVersion: 5.0.3
elementType: C H C H C C C H H C H H C C H H H H H H H
charge: 1
multiplicity: 1
keywords: PBE0 def2-TZVP EnGrad D3BJ RIJCOSX verytightscf def2/J soscf
formula: C8H13
InChI: InChI=1/C8H13/c1-2-4-6-8-7-5-3-1/h1-2,7H,3-6,8H2
21 atoms
C  -1.997358 0.748845 0.074373
H  -2.179187 0.853911 1.147174
C  -1.740002 -0.948079 -0.150024
H  -2.618464 -1.325742 0.378413
C  -0.424029 -1.376292 0.399808
C  0.691601 -1.282706 -0.36915
C  2.005276 -0.687879 0.06563
H  2.216939 -0.878799 1.123463
H  2.857968 -1.028875 -0.52666
C  1.795328 0.880626 -0.144948
H  1.84921 1.128873 -1.210273
H  2.603303 1.419832 0.355117
C  0.422018 1.252866 0.466634
C  -0.761884 1.314125 -0.379276
H  0.527988 -1.212844 -1.449184
H  -1.841348 -1.122382 -1.222042
H  0.143413 0.388326 1.084093
H  -0.643736 1.472236 -1.454969
H  -2.87569 0.984298 -0.52623
H  0.413227 2.015991 1.266559
H  -0.344156 -1.505767 1.480115
totalener: -312.02286072 hartree
nucrepener: 380.22252845 hartree
electener: -692.24538917 hartree
oneelecener: -1161.41994041 hartree
twoeener: 469.17455124 hartree
kineticenergy: 310.15842352 hartree
exchangeener: -34.164453309890 hartree
correlationener: -1.964333482211 hartree
xcener: -36.128786792101 hartree
chargesum: 1.0000000
charge: -0.237471 0.195410 -0.236385 0.196955 -0.177589 -0.089839 -0.222523 0.162625 0.167809 -0.286930 0.163100 0.172704 -0.121488 0.058031 0.140488 0.187767 0.132453 0.193377 0.195945 0.224910 0.180652
charge: -0.171719 0.170673 -0.139406 0.167697 -0.196138 -0.106601 -0.220276 0.154668 0.153801 -0.207290 0.149195 0.157417 -0.216902 0.086661 0.156849 0.158673 0.209850 0.171657 0.165058 0.200214 0.155920
qa: -0.2375 0.1954 -0.2364 0.1970 -0.1776 -0.0898 -0.2225 0.1626 0.1678 -0.2869 0.1631 0.1727 -0.1215 0.0580 0.1405 0.1878 0.1325 0.1934 0.1959 0.2249 0.1807
va: 3.9046 0.9601 3.9229 0.9553 3.8776 3.9443 3.9030 0.9691 0.9731 3.9743 0.9661 0.9684 3.7700 3.7539 0.9671 0.9594 1.0424 0.9542 0.9630 0.9451 0.9584
dispcorr: -0.019081339 hartree
energy: -312.041942058838
dipole: 0.10252 -0.87335 -0.77084 1.11381 -0.18452 0.92929 0.41744 -0.48006 -0.06263
magnitude: 1.20900 au
magnitude: 3.07305 debye
