program: Orca
programVersion: 5.0.3
elementType: C H C H C C C H H C H H C C H H H H H H H
charge: 1
multiplicity: 1
keywords: m062x def2-TZVP EnGrad RIJCOSX verytightscf def2/J soscf
formula: C8H13
InChI: InChI=1/C8H13/c1-2-4-6-8-7-5-3-1/h1-2,7H,3-6,8H2
21 atoms
C  -2.002015 0.692051 0.073305
H  -2.176903 0.793325 1.148904
C  -1.755995 -0.964729 -0.171828
H  -2.629129 -1.390634 0.33021
C  -0.411312 -1.36731 0.377345
C  0.672143 -1.266096 -0.403939
C  1.981604 -0.707653 0.066896
H  2.175511 -0.932536 1.120903
H  2.844183 -1.037702 -0.520524
C  1.798047 0.83129 -0.122311
H  1.831856 1.092824 -1.185838
H  2.608153 1.376612 0.369344
C  0.440263 1.343423 0.49977
C  -0.749992 1.265796 -0.337563
H  0.515336 -1.195346 -1.484677
H  -1.833972 -1.141077 -1.247068
H  0.262431 0.917369 1.489202
H  -0.653406 1.624412 -1.36718
H  -2.865553 0.990806 -0.523064
H  0.567164 2.441941 0.631413
H  -0.315799 -1.439437 1.460443
totalener: -312.27876273 hartree
nucrepener: 379.13942952 hartree
electener: -691.41819225 hartree
oneelecener: -1159.11884412 hartree
twoeener: 467.70065187 hartree
kineticenergy: 310.38848459 hartree
xcener: -23.089155894546 hartree
chargesum: 1.0000000
charge: -0.349444 0.231574 -0.289210 0.210023 -0.185997 -0.114274 -0.331706 0.198094 0.194297 -0.314281 0.200692 0.197948 -0.274453 0.148406 0.171789 0.217218 0.204270 0.240050 0.212318 0.239586 0.193100
charge: -0.177342 0.175171 -0.147275 0.160330 -0.168863 -0.144052 -0.228500 0.155402 0.156824 -0.202968 0.150706 0.156880 -0.208343 0.134118 0.155849 0.157339 0.166507 0.178273 0.165114 0.211616 0.153215
qa: -0.3494 0.2316 -0.2892 0.2100 -0.1860 -0.1143 -0.3317 0.1981 0.1943 -0.3143 0.2007 0.1979 -0.2745 0.1484 0.1718 0.2172 0.2043 0.2401 0.2123 0.2396 0.1931
va: 3.7700 0.9361 3.7063 0.9519 3.6695 3.6558 3.7537 0.9511 0.9602 3.7187 0.9445 0.9544 3.7045 3.3620 0.9560 0.9423 0.9576 0.9290 0.9577 0.9355 0.9548
energy: -312.278762734078
dipole: 0.30891 -1.06885 -0.75995 1.96659 -0.61137 1.35523 0.20792 -0.35410 -0.14618
magnitude: 1.56062 au
magnitude: 3.96677 debye
