program: Orca
programVersion: 5.0.3
elementType: C H C H C C C H H C H H C C H H H H H H H
charge: 1
multiplicity: 1
keywords: DSD-PBEP86 def2-TZVP D3BJ RIJCOSX verytightscf def2-TZVP/C def2/J soscf noTRAH
formula: C8H13
InChI: InChI=1/C8H13/c1-2-4-6-8-7-5-3-1/h1-2,7H,3-6,8H2
21 atoms
C  -2.00197 0.725193 0.080165
H  -2.204074 0.872898 1.144801
C  -1.760391 -0.93026 -0.144376
H  -2.618968 -1.362239 0.374648
C  -0.429274 -1.358053 0.408428
C  0.697374 -1.284624 -0.36437
C  2.008756 -0.687103 0.070293
H  2.222232 -0.879183 1.127246
H  2.859223 -1.021984 -0.527542
C  1.801429 0.896845 -0.144118
H  1.860356 1.132513 -1.211864
H  2.615363 1.424907 0.356605
C  0.424744 1.270473 0.439122
C  -0.743904 1.319491 -0.371155
H  0.530649 -1.20911 -1.443501
H  -1.850199 -1.127057 -1.214974
H  0.077693 0.204773 0.760008
H  -0.604998 1.347041 -1.456239
H  -2.869116 0.991844 -0.524981
H  0.367998 1.716631 1.440555
H  -0.347488 -1.517718 1.485737
totalener: -311.07071118 hartree
nucrepener: 381.28583886 hartree
electener: -692.35655004 hartree
oneelecener: -1162.76281256 hartree
twoeener: 470.40626252 hartree
kineticenergy: 309.95867759 hartree
exchangeener: -13.661735637187 hartree
correlationener: -0.925117041409 hartree
xcener: -14.586852678596 hartree
chargesum: 1.0000000
charge: -0.220537 0.178938 -0.279087 0.189801 -0.095598 -0.118729 -0.196997 0.158888 0.170475 -0.321208 0.166526 0.176487 -0.022370 0.032669 0.146656 0.178456 0.055563 0.192142 0.190603 0.227099 0.190222
charge: -0.179573 0.158307 -0.163953 0.157900 -0.201262 -0.091712 -0.206548 0.149221 0.149366 -0.197196 0.144891 0.151360 -0.206483 0.096770 0.154078 0.150903 0.265880 0.170497 0.158316 0.183126 0.156112
qa: -0.2205 0.1789 -0.2791 0.1898 -0.0956 -0.1187 -0.1970 0.1589 0.1705 -0.3212 0.1665 0.1765 -0.0224 0.0327 0.1467 0.1785 0.0556 0.1921 0.1906 0.2271 0.1902
va: 3.8299 0.9687 3.9564 0.9599 3.6626 3.9352 3.8354 0.9724 0.9710 3.9666 0.9641 0.9703 3.5432 3.7509 0.9666 0.9631 1.1158 0.9510 0.9641 0.9489 0.9599
total: -311.753650744 hartree
dispcorr: -0.012078029 hartree
energy: -311.765728773391
dipole: 0.03627 -0.58521 -0.54894 0.53777 0.23879 0.77655 0.29124 -0.38559 -0.09435
magnitude: 0.95566 au
magnitude: 2.42908 debye
