program: Orca
programVersion: 5.0.3
charge: 1
multiplicity: 1
keywords: DLPNO-CCSD(T1) tightPNO Extrapolate(3/4,def2) RIJK def2/JK verytightSCF miniprint nopop
formula: C8H13
InChI: InChI=1/C8H13/c1-2-4-6-8-7-5-3-1/h1-2,7H,3-6,8H2
21 atoms
C  -1.997926 0.759291 0.070889
H  -2.164458 0.836829 1.148079
C  -1.731325 -0.96264 -0.156072
H  -2.618362 -1.316235 0.373912
C  -0.418395 -1.385261 0.39445
C  0.687402 -1.27807 -0.375163
C  2.002441 -0.690367 0.06334
H  2.211622 -0.88548 1.120773
H  2.856399 -1.033097 -0.52671
C  1.790388 0.863746 -0.142016
H  1.835403 1.121821 -1.205643
H  2.594731 1.410501 0.356915
C  0.421701 1.256836 0.484816
C  -0.767445 1.304256 -0.376313
H  0.523296 -1.205301 -1.454993
H  -1.835898 -1.124823 -1.229258
H  0.178846 0.532003 1.269922
H  -0.657747 1.565464 -1.432495
H  -2.881311 0.988865 -0.523431
H  0.4551 2.202285 1.062891
H  -0.337896 -1.491473 1.476051
e0: -310.272866399 hartree
corrType: DLPNO BASED
e0: -310.286546524 hartree
basis: def2-TZVPP def2-QZVPP
scfener: -310.272866399 -310.286546524
corrmethod: MDCI MDCI
correner: -1.452948402 -1.523387502
corrcbsextra: -1.575564574
energy: -311.863995380160
dipole: 0.14952 -1.06963 -0.92011 1.49943 -0.23654 1.26289 0.40836 -0.61152 -0.20317
magnitude: 1.57568 au
magnitude: 4.00507 debye
