program: Orca
programVersion: 5.0.3
charge: 1
multiplicity: 1
keywords: DLPNO-CCSD(T1) tightPNO Extrapolate(3/4,def2) RIJK def2/JK verytightSCF miniprint nopop
formula: C8H13
InChI: InChI=1/C8H13/c1-2-4-6-8-7-5-3-1/h1-2,7H,3-6,8H2
21 atoms
C  -1.989882 0.570377 0.098425
H  -2.166428 0.750751 1.164138
C  -1.856434 -0.968164 -0.174319
H  -2.659115 -1.515186 0.327632
C  -0.457667 -1.27734 0.335576
C  0.640117 -1.218003 -0.455802
C  1.932067 -0.688076 0.072655
H  2.081688 -0.945664 1.126391
H  2.800774 -1.037109 -0.495145
C  1.836258 0.864184 -0.087615
H  1.890204 1.127564 -1.150514
H  2.679537 1.354744 0.406856
C  0.503952 1.444671 0.511421
C  -0.653613 1.103219 -0.313295
H  0.528773 -1.28962 -1.538805
H  -1.923998 -1.164912 -1.249196
H  0.363283 1.170667 1.560233
H  -0.541197 1.324252 -1.379392
H  -2.800597 1.013871 -0.490465
H  0.61822 2.545558 0.456769
H  -0.326943 -1.282509 1.419113
e0: -310.307294116 hartree
corrType: DLPNO BASED
e0: -310.320974677 hartree
basis: def2-TZVPP def2-QZVPP
scfener: -310.307294116 -310.320974677
corrmethod: MDCI MDCI
correner: -1.446190707 -1.516629914
corrcbsextra: -1.568807066
energy: -311.891666085973
dipole: 0.50993 -1.07766 -0.56773 1.92134 -0.80906 1.11229 0.14750 -0.34711 -0.19961
magnitude: 1.26465 au
magnitude: 3.21450 debye
