program: Orca
programVersion: 5.0.3
elementType: C H C H C C C H H C H H C C H H H H H H H
charge: 1
multiplicity: 1
keywords: b3lyp cc-pVTZ EnGrad D3BJ RIJCOSX verytightscf cc-pVTZ/C def2/J soscf
formula: C8H13
InChI: InChI=1/C8H13/c1-2-4-6-8-7-5-3-1/h1-2,7H,3-6,8H2
21 atoms
C  -1.989926 0.565932 0.10131
H  -2.166235 0.747497 1.166609
C  -1.864111 -0.970542 -0.174585
H  -2.661125 -1.521925 0.331294
C  -0.462243 -1.268759 0.331099
C  0.637503 -1.211841 -0.46024
C  1.928962 -0.685464 0.072563
H  2.074092 -0.946276 1.126167
H  2.797632 -1.037586 -0.493145
C  1.839818 0.867839 -0.083638
H  1.89749 1.132794 -1.146018
H  2.685105 1.35269 0.413002
C  0.509095 1.450537 0.511011
C  -0.645139 1.083948 -0.310601
H  0.529645 -1.294537 -1.542591
H  -1.934632 -1.167356 -1.249239
H  0.370177 1.190365 1.563736
H  -0.528116 1.282985 -1.380408
H  -2.79513 1.019918 -0.487404
H  0.614673 2.551151 0.442653
H  -0.329374 -1.266632 1.414461
totalener: -312.23376122 hartree
nucrepener: 381.33132632 hartree
electener: -693.56508754 hartree
oneelecener: -1163.65948293 hartree
twoeener: 470.09439538 hartree
kineticenergy: 309.97601619 hartree
exchangeener: -36.303974515592 hartree
correlationener: -2.304944710848 hartree
xcener: -38.608919226440 hartree
chargesum: 1.0000000
charge: -0.164047 0.147343 -0.166337 0.152307 -0.083814 -0.103065 -0.178652 0.134078 0.152050 -0.185871 0.130184 0.153737 -0.162794 0.033530 0.170029 0.138166 0.141228 0.197514 0.158109 0.180351 0.155952
charge: 0.092345 0.003769 0.095039 -0.001832 0.109746 0.090777 0.077135 -0.002064 0.005333 0.111116 -0.008097 -0.001395 0.073949 0.321215 -0.012924 -0.001007 0.001713 0.009749 0.007442 0.038449 -0.010459
qa: -0.1640 0.1473 -0.1663 0.1523 -0.0838 -0.1031 -0.1787 0.1341 0.1521 -0.1859 0.1302 0.1537 -0.1628 0.0335 0.1700 0.1382 0.1412 0.1975 0.1581 0.1804 0.1560
va: 3.8136 0.9888 3.8463 0.9819 3.7900 3.7979 3.8676 0.9919 0.9832 3.8299 0.9894 0.9798 3.8533 3.5693 0.9849 0.9921 0.9930 0.9750 0.9823 0.9740 0.9937
dispcorr: -0.036694048 hartree
energy: -312.270455267099
dipole: 0.51931 -0.85636 -0.33705 1.91260 -1.14576 0.76684 0.14891 -0.27176 -0.12284
magnitude: 0.84660 au
magnitude: 2.15189 debye
