program: Orca
programVersion: 5.0.3
elementType: C H C H C C C H H C H H C C H H H H H H H
charge: 1
multiplicity: 1
keywords: PBE0 cc-pVTZ EnGrad RIJCOSX verytightscf cc-pVTZ/C def2/J soscf
formula: C8H13
InChI: InChI=1/C8H13/c1-2-4-6-8-7-5-3-1/h1-2,7H,3-6,8H2
21 atoms
C  -1.99905 0.524404 0.11765
H  -2.179525 0.723718 1.177389
C  -1.97311 -1.003435 -0.166139
H  -2.677779 -1.599465 0.415269
C  -0.528671 -1.112214 0.276295
C  0.603963 -1.10385 -0.510263
C  1.905228 -0.644172 0.060274
H  2.000352 -0.953894 1.106418
H  2.753915 -1.045846 -0.499647
C  1.908607 0.92219 -0.026133
H  2.053154 1.224203 -1.069916
H  2.750778 1.321941 0.544709
C  0.564111 1.479438 0.485207
C  -0.530606 0.774824 -0.254306
H  0.525425 -1.291415 -1.580627
H  -2.097607 -1.222024 -1.230591
H  0.451481 1.375213 1.56945
H  -0.413472 0.844971 -1.338871
H  -2.69688 1.109604 -0.488592
H  0.501929 2.552933 0.250323
H  -0.375982 -1.062804 1.35544
totalener: -312.08427630 hartree
nucrepener: 386.37718399 hartree
electener: -698.46146030 hartree
oneelecener: -1173.56001432 hartree
twoeener: 475.09855402 hartree
kineticenergy: 309.66287900 hartree
exchangeener: -34.174825015430 hartree
correlationener: -1.975933550175 hartree
xcener: -36.150758565605 hartree
chargesum: 1.0000000
charge: -0.153931 0.143390 -0.171020 0.155793 -0.040144 -0.036352 -0.184700 0.141510 0.156959 -0.199670 0.140461 0.152895 -0.166473 -0.078105 0.193990 0.142415 0.138891 0.172151 0.154095 0.166779 0.171066
charge: 0.100859 0.000606 0.104229 -0.000463 0.118879 0.171164 0.084067 0.003305 0.008047 0.097652 -0.004723 0.000987 0.065585 0.207939 0.003599 0.000448 -0.000780 0.003994 0.000337 0.022221 0.012046
qa: -0.1539 0.1434 -0.1710 0.1558 -0.0401 -0.0364 -0.1847 0.1415 0.1570 -0.1997 0.1405 0.1529 -0.1665 -0.0781 0.1940 0.1424 0.1389 0.1722 0.1541 0.1668 0.1711
va: 3.8557 0.9955 3.8724 0.9877 3.7960 3.7758 3.9025 0.9928 0.9877 3.8786 0.9891 0.9856 3.8722 3.7550 0.9768 0.9961 0.9936 0.9921 0.9860 0.9806 0.9932
energy: -312.084276301150
dipole: 0.55832 -0.68150 -0.12318 1.85073 -1.82171 0.02901 0.19736 -0.35548 -0.15812
magnitude: 0.20253 au
magnitude: 0.51479 debye
