program: Orca
programVersion: 5.0.3
elementType: C H C H C C C H H C H H C C H H H H H H H
charge: 1
multiplicity: 1
keywords: DSD-PBEP86/2013 cc-pVTZ EnGrad D3BJ RIJCOSX verytightscf cc-pVTZ/C def2/J soscf
formula: C8H13
InChI: InChI=1/C8H13/c1-2-4-6-8-7-5-3-1/h1-2,7H,3-6,8H2
21 atoms
C  -1.997221 0.750735 0.07388
H  -2.176786 0.85159 1.147399
C  -1.73861 -0.950068 -0.150819
H  -2.618385 -1.323541 0.378017
C  -0.423366 -1.377559 0.39915
C  0.691209 -1.28216 -0.369941
C  2.004883 -0.688166 0.065271
H  2.216279 -0.87936 1.123094
H  2.857713 -1.029508 -0.526664
C  1.794455 0.878547 -0.144693
H  1.847672 1.128207 -1.209686
H  2.60203 1.418653 0.35548
C  0.422132 1.25372 0.468374
C  -0.762817 1.312746 -0.379276
H  0.527478 -1.212253 -1.44992
H  -1.840625 -1.122347 -1.222982
H  0.146112 0.397661 1.122506
H  -0.646639 1.486378 -1.452745
H  -2.876546 0.984405 -0.525747
H  0.418919 2.043087 1.239657
H  -0.34357 -1.504445 1.479554
totalener: -311.10417419 hartree
nucrepener: 380.08559095 hartree
electener: -691.18976514 hartree
oneelecener: -1160.52493498 hartree
twoeener: 469.33516984 hartree
kineticenergy: 309.70725708 hartree
exchangeener: -14.115532723352 hartree
correlationener: -0.943822155852 hartree
xcener: -15.059354879204 hartree
chargesum: 1.0000000
charge: -0.256755 0.195308 -0.248070 0.199534 -0.147139 -0.119848 -0.236139 0.156369 0.174915 -0.261649 0.161061 0.179133 -0.240140 0.102055 0.165721 0.188722 0.149160 0.222932 0.202484 0.226734 0.185613
charge: 0.128859 0.011995 0.163617 0.008901 0.021158 0.079260 0.079682 -0.005387 -0.004064 0.106664 -0.012843 -0.002034 0.077531 0.307540 -0.016903 -0.001083 0.013988 0.015380 0.007610 0.038468 -0.018338
qa: -0.2568 0.1953 -0.2481 0.1995 -0.1471 -0.1198 -0.2361 0.1564 0.1749 -0.2616 0.1611 0.1791 -0.2401 0.1021 0.1657 0.1887 0.1492 0.2229 0.2025 0.2267 0.1856
va: 3.8867 0.9728 3.9186 0.9659 3.8266 3.8405 3.9047 0.9869 0.9763 3.8940 0.9843 0.9762 3.8665 3.5722 0.9826 0.9732 1.0215 0.9626 0.9707 0.9626 0.9825
dispcorr: -0.014313575 hartree
energy: -311.795503823389
dipole: 0.10635 -0.96472 -0.85836 1.15963 -0.17216 0.98747 0.42914 -0.51117 -0.08203
magnitude: 1.31096 au
magnitude: 3.33220 debye
