program: Orca
programVersion: 5.0.3
elementType: C H C H C C C H H C H H C C H H H H H H H
charge: 1
multiplicity: 1
keywords: PBE0 cc-pVTZ EnGrad RIJCOSX verytightscf cc-pVTZ/C def2/J soscf
formula: C8H13
InChI: InChI=1/C8H13/c1-2-4-6-8-7-5-3-1/h1-2,7H,3-6,8H2
21 atoms
C  -1.995592 0.536343 0.119336
H  -2.171866 0.725874 1.18184
C  -1.935381 -0.990846 -0.172773
H  -2.673747 -1.577128 0.377426
C  -0.505408 -1.171988 0.291231
C  0.616344 -1.144995 -0.495929
C  1.91024 -0.659857 0.068043
H  2.018524 -0.951448 1.118126
H  2.770736 -1.042938 -0.487654
C  1.880502 0.902986 -0.0461
H  1.98767 1.187981 -1.099487
H  2.731187 1.33338 0.489063
C  0.548584 1.48073 0.496225
C  -0.569224 0.884104 -0.275686
H  0.533183 -1.306675 -1.570344
H  -2.03979 -1.19383 -1.242933
H  0.426623 1.333614 1.573945
H  -0.435906 0.949794 -1.358518
H  -2.736858 1.082477 -0.473926
H  0.54894 2.568487 0.310565
H  -0.35808 -1.124046 1.371663
totalener: -312.07706464 hartree
nucrepener: 384.43807379 hartree
electener: -696.51513843 hartree
oneelecener: -1169.75170651 hartree
twoeener: 473.23656808 hartree
kineticenergy: 309.64871307 hartree
exchangeener: -34.165389192354 hartree
correlationener: -1.971285725224 hartree
xcener: -36.136674917578 hartree
chargesum: 1.0000000
charge: -0.158436 0.145537 -0.166428 0.154719 -0.060638 -0.073506 -0.181398 0.140832 0.155975 -0.199795 0.138792 0.153326 -0.165204 -0.045182 0.191853 0.142604 0.143452 0.184451 0.155651 0.173659 0.169736
charge: 0.091580 0.001578 0.095965 -0.000069 0.122961 0.140429 0.078734 0.002053 0.007566 0.098508 -0.004668 0.000773 0.064994 0.255188 -0.001906 0.001136 0.001476 0.004831 0.004189 0.029761 0.004923
qa: -0.1584 0.1455 -0.1664 0.1547 -0.0606 -0.0735 -0.1814 0.1408 0.1560 -0.1998 0.1388 0.1533 -0.1652 -0.0452 0.1919 0.1426 0.1435 0.1845 0.1557 0.1737 0.1697
va: 3.8525 0.9943 3.8707 0.9878 3.8054 3.8021 3.8993 0.9934 0.9878 3.8746 0.9895 0.9853 3.8761 3.7091 0.9780 0.9960 0.9927 0.9845 0.9861 0.9794 0.9921
energy: -312.077064636465
dipole: 0.56285 -0.75907 -0.19622 1.85862 -1.59188 0.26673 0.17767 -0.31562 -0.13795
magnitude: 0.35872 au
magnitude: 0.91179 debye
