program: Orca
programVersion: 5.0.3
elementType: C H C H C C C H H C H H C C H H H H H H H
charge: 1
multiplicity: 1
keywords: b3lyp def2-TZVP EnGrad D3BJ RIJCOSX verytightscf def2/J soscf
formula: C8H13
InChI: InChI=1/C8H13/c1-2-4-6-8-7-5-3-1/h1-2,7H,3-6,8H2
21 atoms
C  -1.994127 0.608547 0.082701
H  -2.172109 0.775426 1.151573
C  -1.810828 -0.953487 -0.171905
H  -2.64514 -1.468845 0.312898
C  -0.431387 -1.322684 0.359378
C  0.657064 -1.248075 -0.429888
C  1.954721 -0.701746 0.07172
H  2.130073 -0.942247 1.125348
H  2.821724 -1.034348 -0.509255
C  1.817333 0.844649 -0.107612
H  1.856306 1.102733 -1.171999
H  2.644689 1.366595 0.381289
C  0.471331 1.401352 0.507884
C  -0.70269 1.198012 -0.325473
H  0.523247 -1.246903 -1.514297
H  -1.868134 -1.147837 -1.2476
H  0.31711 1.050983 1.530866
H  -0.612333 1.52826 -1.365368
H  -2.831999 0.990274 -0.508673
H  0.617226 2.501969 0.532884
H  -0.31544 -1.372397 1.442889
totalener: -312.22764657 hartree
nucrepener: 379.93423285 hartree
electener: -692.16187942 hartree
oneelecener: -1160.93829177 hartree
twoeener: 468.77641235 hartree
kineticenergy: 310.52328544 hartree
exchangeener: -36.321620897494 hartree
correlationener: -2.303759338519 hartree
xcener: -38.625380236012 hartree
chargesum: 1.0000000
charge: -0.185142 0.166288 -0.201715 0.165376 -0.134536 -0.088246 -0.205463 0.147888 0.158666 -0.231786 0.147282 0.162806 -0.117502 0.050935 0.142989 0.157590 0.149422 0.201233 0.170128 0.190280 0.153506
charge: -0.191872 0.167161 -0.186114 0.153336 -0.111172 -0.130400 -0.217343 0.152778 0.159202 -0.190982 0.147903 0.153668 -0.208574 0.140410 0.155546 0.154759 0.160431 0.172520 0.163247 0.202613 0.152883
qa: -0.1851 0.1663 -0.2017 0.1654 -0.1345 -0.0882 -0.2055 0.1479 0.1587 -0.2318 0.1473 0.1628 -0.1175 0.0509 0.1430 0.1576 0.1494 0.2012 0.1701 0.1903 0.1535
va: 3.8367 0.9656 3.8306 0.9675 3.8392 3.7999 3.8835 0.9699 0.9704 3.8649 0.9671 0.9639 3.8092 3.5736 0.9681 0.9700 0.9808 0.9445 0.9682 0.9563 0.9666
dispcorr: -0.036528783 hartree
energy: -312.264175349725
dipole: 0.43584 -0.90607 -0.47023 1.96943 -0.84098 1.12845 0.15025 -0.27235 -0.12210
magnitude: 1.22858 au
magnitude: 3.12281 debye
