program: Orca
programVersion: 5.0.3
elementType: C H C H C C C H H C H H C C H H H H H H H
charge: 1
multiplicity: 1
keywords: b3lyp def2-TZVP EnGrad RIJCOSX verytightscf def2/J soscf
formula: C8H13
InChI: InChI=1/C8H13/c1-2-4-6-8-7-5-3-1/h1-2,7H,3-6,8H2
21 atoms
C  -1.997221 0.750735 0.07388
H  -2.176786 0.85159 1.147399
C  -1.73861 -0.950068 -0.150819
H  -2.618385 -1.323541 0.378017
C  -0.423366 -1.377559 0.39915
C  0.691209 -1.28216 -0.369941
C  2.004883 -0.688166 0.065271
H  2.216279 -0.87936 1.123094
H  2.857713 -1.029508 -0.526664
C  1.794455 0.878547 -0.144693
H  1.847672 1.128207 -1.209686
H  2.60203 1.418653 0.35548
C  0.422132 1.25372 0.468374
C  -0.762817 1.312746 -0.379276
H  0.527478 -1.212253 -1.44992
H  -1.840625 -1.122347 -1.222982
H  0.146112 0.397661 1.122506
H  -0.646639 1.486378 -1.452745
H  -2.876546 0.984405 -0.525747
H  0.418919 2.043087 1.239657
H  -0.34357 -1.504445 1.479554
totalener: -312.19854781 hartree
nucrepener: 380.08559095 hartree
electener: -692.28413875 hartree
oneelecener: -1161.18543890 hartree
twoeener: 468.90130015 hartree
kineticenergy: 310.51475298 hartree
exchangeener: -36.313970480011 hartree
correlationener: -2.304497564352 hartree
xcener: -38.618468044363 hartree
chargesum: 1.0000000
charge: -0.222469 0.182747 -0.221670 0.185267 -0.155461 -0.064409 -0.209484 0.149223 0.156995 -0.266624 0.150586 0.160111 -0.101624 0.070076 0.130768 0.176554 0.124743 0.191331 0.183873 0.211882 0.167583
charge: -0.164032 0.167306 -0.131129 0.164512 -0.189138 -0.101290 -0.213164 0.150705 0.150365 -0.201387 0.145231 0.153981 -0.211199 0.087138 0.153130 0.155198 0.205894 0.168856 0.161645 0.195327 0.152051
qa: -0.2225 0.1827 -0.2217 0.1853 -0.1555 -0.0644 -0.2095 0.1492 0.1570 -0.2666 0.1506 0.1601 -0.1016 0.0701 0.1308 0.1766 0.1247 0.1913 0.1839 0.2119 0.1676
va: 3.8443 0.9615 3.8495 0.9566 3.7854 3.8248 3.8458 0.9687 0.9728 3.9030 0.9660 0.9696 3.6823 3.6319 0.9679 0.9601 1.0267 0.9542 0.9648 0.9467 0.9630
energy: -312.198547805783
dipole: 0.10635 -0.88666 -0.78031 1.15963 -0.23333 0.92630 0.42914 -0.49597 -0.06683
magnitude: 1.21300 au
magnitude: 3.08321 debye
