program: Orca
programVersion: 5.0.3
elementType: C H C H C C C H H C H H C C H H H H H H H
charge: 1
multiplicity: 1
keywords: b3lyp cc-pVTZ EnGrad D3BJ RIJCOSX verytightscf cc-pVTZ/C def2/J soscf
formula: C8H13
InChI: InChI=1/C8H13/c1-2-4-6-8-7-5-3-1/h1-2,7H,3-6,8H2
21 atoms
C  -1.998339 0.75978 0.070474
H  -2.163256 0.83412 1.148088
C  -1.730615 -0.964666 -0.157114
H  -2.618364 -1.316722 0.372606
C  -0.417467 -1.386087 0.393727
C  0.686796 -1.277231 -0.3763
C  2.00195 -0.691041 0.063101
H  2.210618 -0.887294 1.120398
H  2.856141 -1.033635 -0.526784
C  1.78975 0.860914 -0.141242
H  1.833106 1.120234 -1.204673
H  2.593797 1.408585 0.357239
C  0.421775 1.258921 0.486987
C  -0.767682 1.302657 -0.375002
H  0.522481 -1.203581 -1.456049
H  -1.835038 -1.1258 -1.230465
H  0.183853 0.556153 1.29238
H  -0.658541 1.577396 -1.4278
H  -2.881971 0.990226 -0.523044
H  0.461553 2.225289 1.030304
H  -0.336615 -1.489372 1.475453
totalener: -312.20551278 hartree
nucrepener: 379.55822723 hartree
electener: -691.76374001 hartree
oneelecener: -1160.15833481 hartree
twoeener: 468.39459479 hartree
kineticenergy: 309.98550294 hartree
exchangeener: -36.295589735594 hartree
correlationener: -2.303782136206 hartree
xcener: -38.599371871800 hartree
chargesum: 1.0000000
charge: -0.199310 0.169198 -0.189320 0.174921 -0.117009 -0.086831 -0.169802 0.126445 0.145754 -0.202859 0.131946 0.149889 -0.179964 0.107634 0.134173 0.163501 0.131337 0.199472 0.176170 0.188980 0.145674
charge: 0.134761 0.012012 0.175498 0.006926 0.023212 0.078735 0.079832 -0.005798 -0.004634 0.109431 -0.013395 -0.002263 0.081543 0.299673 -0.017776 -0.002299 0.007296 0.013375 0.004860 0.042409 -0.023397
qa: -0.1993 0.1692 -0.1893 0.1749 -0.1170 -0.0868 -0.1698 0.1264 0.1458 -0.2029 0.1319 0.1499 -0.1800 0.1076 0.1342 0.1635 0.1313 0.1995 0.1762 0.1890 0.1457
va: 3.8324 0.9813 3.8561 0.9722 3.7887 3.8009 3.8539 0.9935 0.9834 3.8435 0.9905 0.9814 3.8333 3.5460 0.9931 0.9811 1.0121 0.9731 0.9797 0.9725 0.9965
dispcorr: -0.036774012 hartree
energy: -312.242286791391
dipole: 0.15706 -1.01173 -0.85467 1.55031 -0.49584 1.05446 0.40052 -0.50724 -0.10672
magnitude: 1.36152 au
magnitude: 3.46071 debye
