program: Orca
programVersion: 5.0.3
charge: 1
multiplicity: 1
keywords: DLPNO-CCSD(T1) tightPNO Extrapolate(3/4,def2) RIJK def2/JK verytightSCF miniprint nopop
formula: C8H13
InChI: InChI=1/C8H13/c1-2-4-6-8-7-5-3-1/h1-2,7H,3-6,8H2
21 atoms
C  -1.990543 0.558229 0.106697
H  -2.166454 0.741809 1.171262
C  -1.879219 -0.974948 -0.174862
H  -2.664704 -1.534652 0.33919
C  -0.471282 -1.250808 0.322189
C  0.632636 -1.198972 -0.468778
C  1.923572 -0.680235 0.072179
H  2.060033 -0.947555 1.125366
H  2.791743 -1.038542 -0.489889
C  1.847255 0.87517 -0.07558
H  1.913282 1.143654 -1.136695
H  2.695725 1.348638 0.42648
C  0.518708 1.460609 0.509344
C  -0.628586 1.044067 -0.304641
H  0.531239 -1.302022 -1.54962
H  -1.95612 -1.171886 -1.248984
H  0.383102 1.227247 1.569082
H  -0.50331 1.201415 -1.380132
H  -2.784092 1.032735 -0.481952
H  0.605158 2.560161 0.414391
H  -0.334515 -1.235323 1.405064
e0: -310.311243781 hartree
corrType: DLPNO BASED
e0: -310.324895456 hartree
basis: def2-TZVPP def2-QZVPP
scfener: -310.311243781 -310.324895456
corrmethod: MDCI MDCI
correner: -1.447567622 -1.517927979
corrcbsextra: -1.570046723
energy: -311.896822543071
dipole: 0.53515 -1.04153 -0.50637 1.89627 -0.98554 0.91073 0.15308 -0.34782 -0.19474
magnitude: 1.06008 au
magnitude: 2.69450 debye
