program: Orca
programVersion: 5.0.3
elementType: C H C H C C C H H C H H C C H H H H H H H
charge: 1
multiplicity: 1
keywords: DSD-PBEP86 def2-TZVP RIJCOSX verytightscf def2-TZVP/C def2/J soscf noTRAH
formula: C8H13
InChI: InChI=1/C8H13/c1-2-4-6-8-7-5-3-1/h1-2,7H,3-6,8H2
21 atoms
C  -1.996548 0.626198 0.079344
H  -2.174526 0.782765 1.149737
C  -1.796613 -0.951616 -0.171637
H  -2.640642 -1.451318 0.312903
C  -0.424184 -1.33545 0.365143
C  0.661894 -1.254692 -0.422574
C  1.962165 -0.704635 0.070855
H  2.143908 -0.940703 1.124392
H  2.828343 -1.034132 -0.513056
C  1.812115 0.839858 -0.112169
H  1.848772 1.098002 -1.176515
H  2.63403 1.369833 0.377087
C  0.461729 1.386421 0.505485
C  -0.716478 1.219628 -0.32828
H  0.521103 -1.231358 -1.506357
H  -1.85554 -1.144097 -1.247272
H  0.302146 1.016734 1.520568
H  -0.627809 1.567518 -1.36254
H  -2.841332 0.988554 -0.513172
H  0.608639 2.487067 0.553898
H  -0.313652 -1.395031 1.448472
totalener: -311.15083053 hartree
nucrepener: 379.68820234 hartree
electener: -690.83903286 hartree
oneelecener: -1159.81098969 hartree
twoeener: 468.97195683 hartree
kineticenergy: 309.99403849 hartree
exchangeener: -12.756067505241 hartree
correlationener: -0.943257374387 hartree
xcener: -13.699324879629 hartree
chargesum: 1.0000000
charge: -0.217839 0.181987 -0.217171 0.179544 -0.183313 -0.143399 -0.209717 0.155654 0.165065 -0.257692 0.153692 0.174016 -0.159370 0.115573 0.152004 0.172141 0.163742 0.218555 0.185229 0.205389 0.165909
charge: -0.186930 0.167031 -0.178090 0.152153 -0.138574 -0.143719 -0.219930 0.149634 0.152204 -0.192638 0.144046 0.150453 -0.207276 0.201110 0.151974 0.152286 0.160355 0.176247 0.160895 0.198868 0.149901
qa: -0.2178 0.1820 -0.2172 0.1795 -0.1833 -0.1434 -0.2097 0.1557 0.1651 -0.2577 0.1537 0.1740 -0.1594 0.1156 0.1520 0.1721 0.1637 0.2186 0.1852 0.2054 0.1659
va: 3.8500 0.9638 3.8558 0.9664 3.8683 3.8456 3.8829 0.9727 0.9719 3.8869 0.9689 0.9630 3.8359 3.4799 0.9665 0.9680 0.9796 0.9368 0.9671 0.9535 0.9646
total: -311.830095779 hartree
energy: -311.830095778896
dipole: 0.40603 -1.06428 -0.65824 1.97897 -0.57345 1.40553 0.15738 -0.34010 -0.18272
magnitude: 1.56275 au
magnitude: 3.97219 debye
