program: Gaussian 09
title: 000051260
version: EM64L-G09RevD.01
frameworkgroup: C1[X(C5H11BrFN)]
method: RPBEPBE
basis: SDD
operation: Freq
keyword: #p
keyword: freq=noraman
keyword: PBEPBE/SDD
title: #p freq=noraman PBEPBE/SDD
converged: YES YES NO NO
title: Mulliken charges:
elementType: Br F N C C C C C H H H H H H H H H H H
charge: -0.052899 -0.244921 -0.108825 -0.326119 -0.382659 -0.632873 -0.644388 -0.176434 0.238617 0.234569 0.232162 0.225363 0.236144 0.225021 0.210683 0.286195 0.278499 0.206685 0.195178
chargesum: 0.00000
title: Mulliken charges with hydrogens summed into heavy atoms:
elementType: Br F N C C C C C
charge: -0.052899 -0.244921 -0.108825 0.147068 0.074866 0.038975 -0.079694 0.225429
polarizability: 1.15910454e+02 -7.07456152e+00 6.72531873e+01 -4.30467592e+00 -3.32456518e-02 5.74451416e+01
1716.lowfreq: -3.6010 -0.7589 -0.0003 0.0004 0.0005 11.1432 33.7636 50.4761 79.4947
frequency: 33.7585 50.4316 79.4839 96.6054 142.4162 175.5483 195.1792 227.6516 324.5866 356.0469 419.5923 471.2819 597.4222 761.9412 801.4032 826.1849 930.5077 973.8594 1030.5331 1054.3172 1066.7805 1074.9558 1099.0789 1123.5646 1155.5310 1210.5532 1246.6913 1256.3020 1299.3813 1303.4743 1335.7721 1355.1049 1387.4113 1438.5261 1445.0796 1465.3359 1473.0068 1475.8758 1478.2377 1485.4991 2890.4070 2932.5378 2938.5506 3017.7597 3029.5526 3043.7550 3056.3662 3061.7806 3083.4321 3095.8250 3151.9342
redmass: 5.5065 2.6493 2.3007 3.1524 2.7440 1.4188 2.9985 3.0889 3.8933 3.3967 2.5931 3.2354 4.9664 1.1244 1.1869 3.9387 8.0531 1.3371 2.4740 2.1013 2.4170 2.5435 1.4488 1.4059 1.2173 1.2108 1.7171 1.6143 1.3806 1.3286 1.3213 1.3351 1.3296 1.1431 1.0975 1.0826 1.0677 1.0731 1.0834 1.0605 1.0537 1.0678 1.0687 1.0572 1.0771 1.0934 1.0802 1.0700 1.1004 1.1117 1.1116
irintensity: 0.8865 0.1855 5.7437 3.1277 1.9543 0.7283 2.8229 3.9624 8.6395 21.0766 0.8768 3.5732 100.7933 7.2620 8.5584 12.4501 95.7020 3.0996 38.3860 17.9747 39.7082 5.8492 27.5684 1.3884 4.2827 33.9588 8.6867 5.5133 10.1137 10.3516 10.9926 1.2783 2.5077 5.0680 5.5750 5.4985 15.6601 2.4593 13.5278 14.3460 119.0064 31.3998 85.3488 31.0631 48.6608 7.8997 11.9138 17.7849 28.7875 53.8027 11.0103
temp: 298.150 k
press: 1.00000 atm
elementType: 35 9 7 6 6 6 6 6 1 1 1 1 1 1 1 1 1 1 1
symmnumber: 1
zpe: 412872.0 jmol-1
zpe.correction: 0.157255 hartree
zpe.thermalcorrener: 0.167740 hartree
zpe.thermalcorrenthalpy: 0.168684 hartree
zpe.thermalcorrgfe: 0.118387 hartree
zpe.sumelectzpe: -364.485175 hartree
zpe.sumelectthermal: -364.474690 hartree
zpe.sumelectthermalent: -364.473746 hartree
zpe.sumelectthermalfe: -364.524043 hartree
dipole: -1.1998 2.5691 0.5698
dipole: 2.8921
quadrupole: -74.2168 -58.9390 -57.8674
quadrupole: -7.6204 -2.1548 -0.9114
quadrupole: -10.5424 4.7354 5.8070 -7.6204 -2.1548 -0.9114
hfenergy: -364.6424295 hartree
pointgroup: C01 [X(C5H11Br1F1N1)]
dipole: -0.3263554 1.0892948 0.0401292 debye
dipolederiv: -0.7309547 0.2477967 -0.0696046 0.1859509 -0.2486435 0.0372275 0.0687594 -0.0159886 -0.1691 -0.7205023 -0.2552729 -0.0535047 -0.3351932 -0.478006 -0.0571821 -0.1356417 -0.0988856 -0.3359869 -0.9649855 0.1904983 -0.0525446 0.1581961 -0.6741355 0.1219653 0.0039456 -0.0234012 -0.493919 0.4907732 -0.0931318 -0.0593276 -0.3235781 0.1795972 0.0353473 0.2914419 -0.088711 0.3346848 0.3845761 0.1151646 0.1369253 0.2737802 0.1834736 0.0089686 0.1212701 -0.010644 0.2507157 0.0722179 -0.1217367 0.0013134 -0.2121972 0.5709894 -0.1570512 -0.0973603 -0.0469964 0.3136682 1.0416601 -0.3308675 0.0245883 -0.2386665 0.1855894 0.0079334 -0.2096908 0.1130064 0.0397889 0.7350769 0.1858943 0.0732421 0.2680382 0.5531614 0.0715153 0.1502135 0.0963042 0.3740142 -0.0070102 -0.0784059 0.004855 -0.0743062 -0.081819 0.0099027 -0.0245066 -0.0078053 0.0800423 -0.018708 0.0237616 0.0080371 0.085807 0.0208828 -0.0900277 0.0575575 -0.0570574 -0.1650377 0.002399 0.0823869 0.058328 0.0497543 -0.0776916 -0.0617272 0.0494062 -0.0386043 0.0564369 -0.0841251 -0.0123771 -0.0998024 0.0103953 0.0424781 0.1151135 -0.1461471 0.0645961 -0.1196818 0.0269487 -0.1354523 -0.095502 -0.0616509 -0.0274084 -0.0529172 -0.0800942 -0.0705033 0.0168278 -0.1498553 0.0983001 0.081594 0.034804 0.072988 0.0180456 0.0833661 0.0086287 0.0558982 0.0569025 0.0312195 0.0113036 0.087826 -0.1197118 0.0672617 -0.0456979 0.214565 -0.2166836 -0.0281897 0.0497134 0.0591988 0.0353127 0.0522838 -0.0765089 -0.0140881 -0.0242909 -0.0600021 -0.095331 -0.0830609 0.0270833 -0.0232441 -0.0427608 0.0141344 -0.0002655 -0.003041 0.0768196 0.0072094 0.0202415 -0.0974731 0.0183558 -0.0155402 0.094274 -0.0784851 0.05506 -0.0676087 -0.018102 0.0653281 0.0412901 0.0606156 -0.0957269 -0.106275 0.0060168 -0.0662313 0.0291234 unknown
polarizability: 112.9623625|-14.0225411|70.1287423|1.552228|-2.2835369|57.517678 unknown
InChI: InChI=1S/C5H11BrFN/c1-8(4-2-6)5-3-7/h2-5H2,1H3
charge 0 multiplicity 1
19 atoms
Br 3.729136 -1.024334 0.358724
F  -3.160045 -1.435798 -0.181529
N  -0.133539 0.771022 -0.091962
C  1.283906 0.459988 -0.365563
C  -1.121595 -0.178338 -0.647013
C  -0.513955 2.191462 -0.206117
C  1.785589 -0.514078 0.712526
C  -2.144777 -0.569263 0.428748
H  1.87826 1.389426 -0.317268
H  1.444692 0.023793 -1.376308
H  -0.607035 -1.091024 -0.998868
H  -1.659724 0.247574 -1.523193
H  0.158559 2.813541 0.409862
H  -1.540448 2.340061 0.174149
H  -0.481581 2.572519 -1.254952
H  1.772766 -0.059856 1.713723
H  1.238596 -1.469445 0.711161
H  -1.673175 -1.139521 1.248279
H  -2.67693 0.310372 0.834002
