program: Orca
programVersion: 5.0.3
elementType: C H C H C C C H H C H H C C H H H H H H H
charge: 1
multiplicity: 1
keywords: PBE0 def2-TZVP EnGrad RIJCOSX verytightscf def2/J soscf
formula: C8H13
InChI: InChI=1/C8H13/c1-2-4-6-8-7-5-3-1/h1-2,7H,3-6,8H2
21 atoms
C  -2.00569 0.708869 0.084303
H  -2.216339 0.879682 1.144025
C  -1.777025 -0.922827 -0.140966
H  -2.621346 -1.388964 0.370877
C  -0.4327 -1.346481 0.411233
C  0.699271 -1.28315 -0.362555
C  2.010372 -0.686021 0.074382
H  2.224813 -0.881369 1.130032
H  2.858828 -1.017407 -0.527564
C  1.805244 0.90479 -0.141631
H  1.865704 1.133904 -1.210621
H  2.621396 1.426603 0.361394
C  0.428886 1.287065 0.425601
C  -0.728748 1.315098 -0.362575
H  0.5308 -1.203934 -1.441154
H  -1.858269 -1.130196 -1.211495
H  0.037386 0.109843 0.524836
H  -0.578028 1.292604 -1.446379
H  -2.865018 0.999397 -0.521566
H  0.351175 1.553204 1.484301
H  -0.346467 -1.503582 1.488667
totalener: -312.01465828 hartree
nucrepener: 382.01747922 hartree
electener: -694.03213750 hartree
oneelecener: -1164.71265702 hartree
twoeener: 470.68051952 hartree
kineticenergy: 310.11541832 hartree
exchangeener: -34.159700044856 hartree
correlationener: -1.973654865596 hartree
xcener: -36.133354910452 hartree
chargesum: 1.0000000
charge: -0.214980 0.171238 -0.293084 0.187224 -0.056812 -0.061565 -0.213109 0.163653 0.176856 -0.303990 0.173853 0.181761 -0.012242 -0.012632 0.147458 0.178941 0.047513 0.166057 0.185886 0.202345 0.185630
charge: -0.195640 0.159665 -0.188256 0.162787 -0.181584 -0.077282 -0.210543 0.156483 0.157937 -0.200279 0.154889 0.159138 -0.182254 -0.009151 0.163442 0.156314 0.299113 0.169428 0.162193 0.177978 0.165622
qa: -0.2150 0.1712 -0.2931 0.1872 -0.0568 -0.0616 -0.2131 0.1637 0.1769 -0.3040 0.1739 0.1818 -0.0122 -0.0126 0.1475 0.1789 0.0475 0.1661 0.1859 0.2023 0.1856
va: 3.8955 0.9697 4.0278 0.9637 3.7306 3.9831 3.9010 0.9706 0.9679 4.0321 0.9637 0.9681 3.6511 3.9516 0.9665 0.9634 1.1276 0.9609 0.9648 0.9565 0.9617
energy: -312.014658279222
dipole: 0.00435 -0.22143 -0.21708 0.25313 0.06264 0.31577 0.13638 -0.16384 -0.02746
magnitude: 0.38417 au
magnitude: 0.97649 debye
