program: Orca
programVersion: 5.0.3
elementType: C H C H C C C H H C H H C C H H H H H H H
charge: 1
multiplicity: 1
keywords: DSD-PBEP86/2013 cc-pVTZ EnGrad D3BJ RIJCOSX verytightscf cc-pVTZ/C def2/J soscf
formula: C8H13
InChI: InChI=1/C8H13/c1-2-4-6-8-7-5-3-1/h1-2,7H,3-6,8H2
21 atoms
C  -1.993575 0.517628 0.081752
H  -2.19156 0.771242 1.126454
C  -1.999331 -1.020671 -0.130344
H  -2.68253 -1.586029 0.504054
C  -0.543853 -1.087089 0.28625
C  0.576355 -1.061847 -0.526112
C  1.900809 -0.628689 0.026065
H  2.013568 -0.987913 1.054619
H  2.723826 -1.0304 -0.570456
C  1.935416 0.938196 0.013153
H  2.133881 1.287533 -1.006274
H  2.752998 1.296329 0.644022
C  0.569886 1.471017 0.487039
C  -0.4948 0.709886 -0.258055
H  0.478851 -1.270649 -1.590526
H  -2.151511 -1.296726 -1.177335
H  0.441201 1.376876 1.570711
H  -0.376144 0.802088 -1.341069
H  -2.653109 1.098123 -0.568552
H  0.471702 2.536504 0.237398
H  -0.370664 -1.034794 1.361771
totalener: -311.17377030 hartree
nucrepener: 387.49965621 hartree
electener: -698.67342651 hartree
oneelecener: -1175.17965934 hartree
twoeener: 476.50623283 hartree
kineticenergy: 309.75980740 hartree
exchangeener: -14.131827340270 hartree
correlationener: -0.949745814050 hartree
xcener: -15.081573154320 hartree
chargesum: 1.0000000
charge: -0.210602 0.168410 -0.241469 0.184237 -0.036643 -0.039924 -0.250798 0.164736 0.181562 -0.247628 0.161972 0.179343 -0.235840 -0.093666 0.223911 0.169153 0.158013 0.192265 0.181736 0.189988 0.201242
charge: 0.109962 -0.000381 0.109921 -0.000950 0.125808 0.182335 0.086764 0.002287 0.006069 0.096851 -0.006651 -0.000525 0.067252 0.186138 0.006030 -0.000686 -0.004003 0.004669 -0.002418 0.015367 0.016162
qa: -0.2106 0.1684 -0.2415 0.1842 -0.0366 -0.0399 -0.2508 0.1647 0.1816 -0.2476 0.1620 0.1793 -0.2358 -0.0937 0.2239 0.1692 0.1580 0.1923 0.1817 0.1900 0.2012
va: 3.8640 0.9860 3.8868 0.9776 3.7789 3.7631 3.9193 0.9826 0.9770 3.8928 0.9810 0.9743 3.8904 3.7725 0.9602 0.9854 0.9853 0.9832 0.9752 0.9688 0.9778
dispcorr: -0.013668296 hartree
energy: -311.862037457544
dipole: 0.55338 -0.70840 -0.15502 1.83671 -1.94887 -0.11216 0.22929 -0.39904 -0.16975
magnitude: 0.25578 au
magnitude: 0.65015 debye
