program: Orca
programVersion: 5.0.3
elementType: C H C H C C C H H C H H C C H H H H H H H
charge: 1
multiplicity: 1
keywords: DSD-PBEP86 def2-TZVP D3BJ RIJCOSX verytightscf def2-TZVP/C def2/J soscf noTRAH
formula: C8H13
InChI: InChI=1/C8H13/c1-2-4-6-8-7-5-3-1/h1-2,7H,3-6,8H2
21 atoms
C  -2.00569 0.708869 0.084303
H  -2.216339 0.879682 1.144025
C  -1.777025 -0.922827 -0.140966
H  -2.621346 -1.388964 0.370877
C  -0.4327 -1.346481 0.411233
C  0.699271 -1.28315 -0.362555
C  2.010372 -0.686021 0.074382
H  2.224813 -0.881369 1.130032
H  2.858828 -1.017407 -0.527564
C  1.805244 0.90479 -0.141631
H  1.865704 1.133904 -1.210621
H  2.621396 1.426603 0.361394
C  0.428886 1.287065 0.425601
C  -0.728748 1.315098 -0.362575
H  0.5308 -1.203934 -1.441154
H  -1.858269 -1.130196 -1.211495
H  0.037386 0.109843 0.524836
H  -0.578028 1.292604 -1.446379
H  -2.865018 0.999397 -0.521566
H  0.351175 1.553204 1.484301
H  -0.346467 -1.503582 1.488667
totalener: -311.06998272 hartree
nucrepener: 382.01747922 hartree
electener: -693.08746194 hartree
oneelecener: -1164.09541915 hartree
twoeener: 471.00795721 hartree
kineticenergy: 309.94313095 hartree
exchangeener: -13.661276361825 hartree
correlationener: -0.926635875093 hartree
xcener: -14.587912236919 hartree
chargesum: 1.0000000
charge: -0.213485 0.169654 -0.285724 0.185609 -0.089141 -0.068308 -0.204044 0.160515 0.175298 -0.303031 0.169739 0.180277 -0.044660 0.003677 0.150420 0.174740 0.074160 0.176406 0.185451 0.211766 0.190682
charge: -0.187714 0.154166 -0.181280 0.155623 -0.184604 -0.071224 -0.201834 0.150325 0.151630 -0.193625 0.147744 0.152374 -0.182971 0.027539 0.158537 0.149869 0.298309 0.167839 0.156258 0.173001 0.160039
qa: -0.2135 0.1697 -0.2857 0.1856 -0.0891 -0.0683 -0.2040 0.1605 0.1753 -0.3030 0.1697 0.1803 -0.0447 0.0037 0.1504 0.1747 0.0742 0.1764 0.1855 0.2118 0.1907
va: 3.8418 0.9717 3.9701 0.9646 3.6726 3.9134 3.8487 0.9725 0.9685 3.9761 0.9645 0.9696 3.5788 3.8473 0.9671 0.9649 1.1039 0.9579 0.9650 0.9548 0.9622
total: -311.755580431 hartree
dispcorr: -0.012079466 hartree
energy: -311.767659896754
dipole: 0.00435 -0.26791 -0.26356 0.25313 0.16749 0.42062 0.13638 -0.21286 -0.07648
magnitude: 0.50223 au
magnitude: 1.27657 debye
