program: Orca
programVersion: 5.0.3
elementType: C H C H C C C H H C H H C C H H H H H H H
charge: 1
multiplicity: 1
keywords: m062x def2-TZVP EnGrad RIJCOSX verytightscf def2/J soscf
formula: C8H13
InChI: InChI=1/C8H13/c1-2-4-6-8-7-5-3-1/h1-2,7H,3-6,8H2
21 atoms
C  -1.99905 0.524404 0.11765
H  -2.179525 0.723718 1.177389
C  -1.97311 -1.003435 -0.166139
H  -2.677779 -1.599465 0.415269
C  -0.528671 -1.112214 0.276295
C  0.603963 -1.10385 -0.510263
C  1.905228 -0.644172 0.060274
H  2.000352 -0.953894 1.106418
H  2.753915 -1.045846 -0.499647
C  1.908607 0.92219 -0.026133
H  2.053154 1.224203 -1.069916
H  2.750778 1.321941 0.544709
C  0.564111 1.479438 0.485207
C  -0.530606 0.774824 -0.254306
H  0.525425 -1.291415 -1.580627
H  -2.097607 -1.222024 -1.230591
H  0.451481 1.375213 1.56945
H  -0.413472 0.844971 -1.338871
H  -2.69688 1.109604 -0.488592
H  0.501929 2.552933 0.250323
H  -0.375982 -1.062804 1.35544
totalener: -312.31791778 hartree
nucrepener: 386.37718399 hartree
electener: -698.69510178 hartree
oneelecener: -1173.36589160 hartree
twoeener: 474.67078982 hartree
kineticenergy: 310.41279272 hartree
xcener: -23.113303263351 hartree
chargesum: 1.0000000
charge: -0.260606 0.200082 -0.277117 0.200727 -0.081160 -0.024236 -0.330535 0.203077 0.204257 -0.304753 0.200375 0.199686 -0.290270 -0.088665 0.218273 0.196266 0.191912 0.223110 0.198524 0.213011 0.208040
charge: -0.195449 0.158419 -0.189895 0.155037 -0.065682 -0.022174 -0.211604 0.161394 0.163959 -0.214366 0.153205 0.156815 -0.231217 0.007142 0.169174 0.157858 0.157489 0.176550 0.156148 0.179963 0.177232
qa: -0.2606 0.2001 -0.2771 0.2007 -0.0812 -0.0242 -0.3305 0.2031 0.2043 -0.3048 0.2004 0.1997 -0.2903 -0.0887 0.2183 0.1963 0.1919 0.2231 0.1985 0.2130 0.2080
va: 3.7401 0.9572 3.7520 0.9633 3.7083 3.6062 3.7701 0.9459 0.9582 3.7099 0.9473 0.9574 3.7367 3.5799 0.9435 0.9558 0.9536 0.9340 0.9615 0.9495 0.9452
energy: -312.317917783427
dipole: 0.55832 -0.69838 -0.14006 1.85073 -1.80999 0.04074 0.19736 -0.36140 -0.16404
magnitude: 0.21951 au
magnitude: 0.55795 debye
