program: Orca
programVersion: 5.0.3
elementType: C H C H C C C H H C H H C C H H H H H H H
charge: 1
multiplicity: 1
keywords: m062x cc-pVTZ EnGrad RIJCOSX verytightscf cc-pVTZ/C def2/J soscf
formula: C8H13
InChI: InChI=1/C8H13/c1-2-4-6-8-7-5-3-1/h1-2,7H,3-6,8H2
21 atoms
C  -2.006342 0.696513 0.088695
H  -2.217558 0.878759 1.146578
C  -1.791339 -0.920639 -0.138508
H  -2.625917 -1.408597 0.368296
C  -0.436944 -1.339212 0.410448
C  0.698936 -1.279955 -0.361726
C  2.010422 -0.684096 0.078725
H  2.224485 -0.882339 1.133567
H  2.857425 -1.01475 -0.525267
C  1.80882 0.911059 -0.138895
H  1.872525 1.13569 -1.208513
H  2.625999 1.427988 0.367371
C  0.433965 1.299085 0.416659
C  -0.71675 1.307741 -0.357984
H  0.531447 -1.202853 -1.440463
H  -1.865782 -1.130927 -1.20969
H  0.015839 0.049279 0.366578
H  -0.564058 1.276896 -1.441024
H  -2.862346 1.004668 -0.51362
H  0.343687 1.453575 1.495649
H  -0.345059 -1.475797 1.490297
totalener: -312.24524129 hartree
nucrepener: 382.47480231 hartree
electener: -694.72004360 hartree
oneelecener: -1165.25474786 hartree
twoeener: 470.53470426 hartree
kineticenergy: 309.97738413 hartree
xcener: -23.093392154340 hartree
chargesum: 1.0000000
charge: -0.295620 0.196407 -0.321316 0.195546 -0.090375 -0.060916 -0.293808 0.191490 0.196199 -0.313091 0.193491 0.193438 -0.118414 -0.034000 0.201661 0.195796 0.104111 0.209937 0.199147 0.228009 0.222309
charge: 0.106413 -0.000486 0.115651 0.002308 0.098210 0.149563 0.099959 -0.001532 0.002491 0.115073 -0.003787 0.001428 0.112599 0.183587 0.000790 -0.003665 -0.003450 0.005943 0.003899 0.012444 0.002563
qa: -0.2956 0.1964 -0.3213 0.1955 -0.0904 -0.0609 -0.2938 0.1915 0.1962 -0.3131 0.1935 0.1934 -0.1184 -0.0340 0.2017 0.1958 0.1041 0.2099 0.1991 0.2280 0.2223
va: 3.7319 0.9553 3.7872 0.9556 3.5968 3.6550 3.7367 0.9577 0.9534 3.7823 0.9560 0.9574 3.6054 3.6219 0.9557 0.9546 1.1053 0.9522 0.9531 0.9468 0.9476
energy: -312.245241285518
dipole: -0.00872 -0.07962 -0.08834 0.10488 0.04426 0.14914 0.02804 -0.05304 -0.02501
magnitude: 0.17514 au
magnitude: 0.44517 debye
