program: Orca
programVersion: 5.0.3
elementType: C H C H C C C H H C H H C C H H H H H H H
charge: 1
multiplicity: 1
keywords: b3lyp cc-pVTZ EnGrad RIJCOSX verytightscf cc-pVTZ/C def2/J soscf
formula: C8H13
InChI: InChI=1/C8H13/c1-2-4-6-8-7-5-3-1/h1-2,7H,3-6,8H2
21 atoms
C  -2.001344 0.727767 0.079537
H  -2.201806 0.871367 1.145006
C  -1.75799 -0.931792 -0.144885
H  -2.618778 -1.358028 0.375334
C  -0.428817 -1.359984 0.407655
C  0.696907 -1.284661 -0.364757
C  2.008421 -0.687173 0.069732
H  2.221754 -0.878894 1.126847
H  2.859162 -1.022698 -0.527471
C  1.800832 0.895471 -0.144384
H  1.859558 1.132296 -1.211893
H  2.614305 1.42458 0.356146
C  0.424322 1.268093 0.441574
C  -0.746108 1.319541 -0.372391
H  0.530591 -1.210112 -1.4440
H  -1.849172 -1.126473 -1.215559
H  0.084493 0.22092 0.797275
H  -0.609477 1.358177 -1.457354
H  -2.869716 0.990636 -0.525399
H  0.371641 1.745746 1.429278
H  -0.34739 -1.517836 1.485213
totalener: -312.18248627 hartree
nucrepener: 381.16451246 hartree
electener: -693.34699873 hartree
oneelecener: -1163.14900028 hartree
twoeener: 469.80200155 hartree
kineticenergy: 309.95017311 hartree
exchangeener: -36.289940991832 hartree
correlationener: -2.306535406732 hartree
xcener: -38.596476398565 hartree
chargesum: 1.0000000
charge: -0.191144 0.155281 -0.210550 0.167637 -0.102193 -0.057062 -0.183228 0.134618 0.152437 -0.207720 0.138296 0.153990 -0.135542 0.070795 0.143965 0.153515 0.124400 0.175759 0.171194 0.186151 0.159400
charge: 0.120226 0.003600 0.138483 0.005587 0.047981 0.118245 0.090965 -0.005070 -0.003053 0.116681 -0.010477 -0.002389 0.097081 0.259170 -0.012060 -0.004878 0.008623 0.006959 0.005367 0.029456 -0.010496
qa: -0.1911 0.1553 -0.2106 0.1676 -0.1022 -0.0571 -0.1832 0.1346 0.1524 -0.2077 0.1383 0.1540 -0.1355 0.0708 0.1440 0.1535 0.1244 0.1758 0.1712 0.1862 0.1594
va: 3.8330 0.9860 3.8811 0.9769 3.7840 3.7882 3.8464 0.9914 0.9808 3.8650 0.9900 0.9838 3.7879 3.6331 0.9901 0.9852 1.0593 0.9816 0.9784 0.9852 0.9931
energy: -312.182486273724
dipole: 0.04235 -0.53607 -0.49371 0.59061 0.01192 0.60253 0.31273 -0.34134 -0.02861
magnitude: 0.77949 au
magnitude: 1.98131 debye
