program: Orca
programVersion: 5.0.3
charge: 1
multiplicity: 1
keywords: DLPNO-CCSD(T1) tightPNO Extrapolate(3/4,def2) RIJK def2/JK verytightSCF miniprint nopop
formula: C8H13
InChI: InChI=1/C8H13/c1-2-4-6-8-7-5-3-1/h1-2,7H,3-6,8H2
21 atoms
C  -1.990333 0.560033 0.105409
H  -2.166334 0.743144 1.170146
C  -1.875464 -0.97388 -0.174825
H  -2.663864 -1.531547 0.337143
C  -0.469031 -1.255405 0.324406
C  0.633814 -1.202255 -0.466689
C  1.924825 -0.681544 0.0723
H  2.06341 -0.947232 1.12561
H  2.793175 -1.0383 -0.490606
C  1.845351 0.873335 -0.0776
H  1.909182 1.1409 -1.139059
H  2.693128 1.349646 0.422972
C  0.516384 1.45829 0.509859
C  -0.632681 1.054189 -0.306207
H  0.530865 -1.300428 -1.547927
H  -1.950722 -1.170772 -1.249092
H  0.379964 1.218351 1.567944
H  -0.509309 1.221546 -1.38049
H  -2.786879 1.02946 -0.48322
H  0.607816 2.558179 0.421456
H  -0.333193 -1.243097 1.407416
e0: -310.310568246 hartree
corrType: DLPNO BASED
e0: -310.324224743 hartree
basis: def2-TZVPP def2-QZVPP
scfener: -310.310568246 -310.324224743
corrmethod: MDCI MDCI
correner: -1.447325437 -1.517705058
corrcbsextra: -1.569838072
energy: -311.895943843683
dipole: 0.53154 -1.04883 -0.51729 1.90018 -0.95431 0.94587 0.15189 -0.34734 -0.19545
magnitude: 1.09565 au
magnitude: 2.78493 debye
