program: Orca
programVersion: 5.0.3
charge: 1
multiplicity: 1
keywords: DLPNO-CCSD(T1) tightPNO Extrapolate(3/4,def2) RIJK def2/JK verytightSCF miniprint nopop
formula: C8H13
InChI: InChI=1/C8H13/c1-2-4-6-8-7-5-3-1/h1-2,7H,3-6,8H2
21 atoms
C  -1.991967 0.550086 0.112397
H  -2.167536 0.735738 1.176215
C  -1.897903 -0.980129 -0.174738
H  -2.668406 -1.54961 0.350248
C  -0.482538 -1.226605 0.311295
C  0.627026 -1.181937 -0.478726
C  1.918112 -0.673645 0.071317
H  2.044392 -0.949123 1.123718
H  2.784802 -1.039822 -0.487308
C  1.857306 0.884368 -0.065524
H  1.935311 1.157744 -1.12464
H  2.708227 1.343625 0.445285
C  0.529631 1.470319 0.505938
C  -0.608442 0.992196 -0.29605
H  0.53277 -1.307462 -1.557466
H  -1.983427 -1.177711 -1.247957
H  0.39817 1.268407 1.573006
H  -0.475769 1.105616 -1.37572
H  -2.769664 1.049504 -0.476745
H  0.589458 2.56739 0.379143
H  -0.341566 -1.196967 1.393395
e0: -310.314692050 hartree
corrType: DLPNO BASED
e0: -310.328320759 hartree
basis: def2-TZVPP def2-QZVPP
scfener: -310.314692050 -310.328320759
corrmethod: MDCI MDCI
correner: -1.448877167 -1.519151166
corrcbsextra: -1.571205942
energy: -311.901403902290
dipole: 0.54986 -0.99701 -0.44715 1.87905 -1.15114 0.72791 0.16022 -0.35252 -0.19230
magnitude: 0.87566 au
magnitude: 2.22574 debye
