program: Gaussian 09
title: 000051257
version: EM64L-G09RevD.01
frameworkgroup: C1[X(C10H15NO2)]
method: RPBEPBE
basis: SDD
operation: Freq
keyword: #p
keyword: freq=noraman
keyword: PBEPBE/SDD
title: #p freq=noraman PBEPBE/SDD
converged: NO YES NO NO
title: Mulliken charges:
elementType: O O N C C C C C C C C C C H H H H H H H H H H H H H H H
charge: -0.296378 -0.226772 -0.002641 0.398260 -0.490441 -0.495967 -0.402499 -0.405330 -0.363155 -0.404194 -0.200734 0.296004 -0.757513 0.218780 0.234860 0.267819 0.216069 0.209027 0.217986 0.223945 0.213070 0.190377 0.198357 0.206941 0.202495 0.246411 0.256317 0.248906
chargesum: 0.00000
title: Mulliken charges with hydrogens summed into heavy atoms:
elementType: O O N C C C C C C C C C C
charge: -0.296378 -0.226772 -0.002641 0.398260 -0.036800 -0.012079 0.024514 0.031685 0.025578 0.005242 -0.200734 0.296004 -0.005879
polarizability: 1.21625469e+02 -4.27358537e+00 1.17096502e+02 -3.43827341e+00 2.04757029e+00 1.00875138e+02
1716.lowfreq: -21.5647 -16.2560 0.0004 0.0009 0.0011 4.8607 22.3155 63.4223 76.3029
frequency: 22.0076 63.0252 76.2733 98.7442 106.2267 134.3863 146.7342 195.6349 213.4794 267.3680 284.3169 331.5638 357.0989 383.5956 409.2216 486.8260 520.8765 531.5251 537.5320 571.3216 610.2164 715.4424 735.5382 761.8480 826.3727 840.8183 865.2653 884.2975 908.2152 945.2702 989.7068 1003.8168 1018.7474 1040.1773 1045.1908 1058.9655 1081.8549 1141.3509 1166.5754 1174.8056 1195.8380 1216.5564 1237.3162 1257.8699 1282.3022 1297.7449 1328.4388 1339.3441 1350.2786 1354.8474 1364.3651 1378.9615 1382.7877 1451.4237 1452.9319 1453.1299 1458.5722 1459.3836 1470.8589 1476.6237 1483.5316 1657.6277 2184.2001 2968.6958 2975.4696 2980.6244 2987.0035 2993.8146 3005.5260 3006.9986 3023.8876 3027.4859 3038.0237 3048.0497 3057.7616 3079.3150 3097.6662 3142.2242
redmass: 1.0797 3.1792 3.5340 5.3883 3.8160 5.1699 2.7953 2.7522 6.4069 2.4157 3.0127 2.9936 2.5166 3.0046 3.0708 2.1568 4.1717 3.9218 4.3063 3.5288 3.5161 2.9795 1.6009 2.6931 2.3765 1.8774 2.8656 2.0163 4.2950 2.1759 1.9313 2.0142 2.2579 1.7355 2.6864 2.1806 1.8717 1.9862 3.0981 1.8783 2.4747 1.2086 1.3811 1.2739 1.1968 1.1617 1.3115 1.3805 1.3669 1.4454 1.3887 1.3526 1.2326 1.0708 1.0636 1.0539 1.0864 1.0850 1.0734 1.0826 1.0880 9.7510 12.6782 1.0608 1.0610 1.0620 1.0650 1.0624 1.0654 1.0375 1.0988 1.0963 1.0998 1.1005 1.1014 1.0995 1.0959 1.1017
irintensity: 1.1064 0.2539 4.1382 0.9756 0.7393 0.6968 1.8474 2.9930 9.0916 0.5275 1.4035 1.8891 0.5935 1.4247 3.2832 1.1044 1.8424 4.1632 1.3944 8.5445 2.3190 5.3603 4.7731 4.8113 10.4173 7.2151 5.6329 3.4223 111.4600 2.8538 63.1450 16.1071 2.2566 20.4845 5.7678 0.9103 3.3599 31.2172 14.9683 101.8231 152.9307 2.8523 4.1696 0.6297 1.2847 2.0930 0.4937 0.2967 0.5888 1.8288 1.5854 2.9331 50.6591 25.5996 3.5347 16.2558 13.4114 6.1237 6.2905 40.7362 7.1320 147.5909 1.8320 29.0208 20.1675 22.5353 38.2751 25.1357 13.0733 1.2511 30.4326 67.1406 17.5779 54.5280 52.5400 17.7116 6.3719 7.9046
temp: 298.150 k
press: 1.00000 atm
elementType: 8 8 7 6 6 6 6 6 6 6 6 6 6 1 1 1 1 1 1 1 1 1 1 1 1 1 1 1
symmnumber: 1
zpe: 613204.1 jmol-1
zpe.correction: 0.233557 hartree
zpe.thermalcorrener: 0.247331 hartree
zpe.thermalcorrenthalpy: 0.248275 hartree
zpe.thermalcorrgfe: 0.192334 hartree
zpe.sumelectzpe: -594.235568 hartree
zpe.sumelectthermal: -594.221795 hartree
zpe.sumelectthermalent: -594.220850 hartree
zpe.sumelectthermalfe: -594.276791 hartree
dipole: 3.8659 -3.0771 -1.6918
dipole: 5.2226
quadrupole: -82.8395 -82.7848 -76.6413
quadrupole: 10.9042 6.8393 0.9436
quadrupole: -2.0843 -2.0296 4.1139 10.9042 6.8393 0.9436
hfenergy: -594.4691256 hartree
pointgroup: C01 [X(C10H15N1O2)]
dipole: 1.677289 0.9788896 0.6711022 debye
polarizability: 122.8102633|3.4804109|115.8811729|3.0695425|2.5359453|100.9056724 unknown
InChI: InChI=1S/C10H15NO2/c1-9(12)13-10(8-11)6-4-2-3-5-7-10/h2-7H2,1H3
charge 0 multiplicity 1
28 atoms
O  -0.551212 0.428884 0.788653
O  -2.187122 1.089618 -0.751765
N  -2.185094 -2.440762 -0.34541
C  -0.132943 -0.741126 -0.067294
C  0.928764 -1.493598 0.787414
C  0.390268 -0.310791 -1.472127
C  2.160339 -0.671192 1.226694
C  1.183186 1.019085 -1.547462
C  2.973643 0.021088 0.104473
C  2.271538 1.277359 -0.469232
C  -1.300038 -1.649769 -0.228658
C  -1.605063 1.249726 0.340511
C  -1.91661 2.297019 1.386181
H  1.251073 -2.367712 0.188925
H  0.425501 -1.888797 1.689612
H  -0.464923 -0.235302 -2.164257
H  1.024855 -1.145712 -1.825869
H  2.822058 -1.367135 1.780033
H  1.837589 0.101137 1.950783
H  0.467394 1.862499 -1.541991
H  1.653701 1.031035 -2.550596
H  3.211758 -0.700702 -0.703883
H  3.945917 0.330646 0.535748
H  1.823436 1.826351 0.381843
H  3.031091 1.953876 -0.907875
H  -0.990491 2.725101 1.803161
H  -2.471067 1.828835 2.21962
H  -2.540651 3.086938 0.943668
