program: Orca
programVersion: 5.0.3
elementType: C H C H C C C H H C H H C C H H H H H H H
charge: 1
multiplicity: 1
keywords: DSD-PBEP86 def2-TZVP RIJCOSX verytightscf def2-TZVP/C def2/J soscf noTRAH
formula: C8H13
InChI: InChI=1/C8H13/c1-2-4-6-8-7-5-3-1/h1-2,7H,3-6,8H2
21 atoms
C  -1.9941 0.541562 0.117355
H  -2.169777 0.729399 1.180414
C  -1.920344 -0.986411 -0.173882
H  -2.671897 -1.566521 0.365635
C  -0.496189 -1.194793 0.29888
C  0.620616 -1.160216 -0.489484
C  1.912981 -0.665514 0.069653
H  2.028051 -0.950682 1.120781
H  2.776511 -1.041601 -0.486546
C  1.870692 0.895492 -0.05375
H  1.965376 1.175519 -1.109749
H  2.722325 1.337546 0.470537
C  0.541428 1.477991 0.500447
C  -0.584781 0.927844 -0.284228
H  0.533593 -1.308779 -1.56561
H  -2.017013 -1.186374 -1.245506
H  0.415453 1.310311 1.574474
H  -0.449312 1.00548 -1.366175
H  -2.750733 1.069647 -0.473587
H  0.566326 2.570198 0.337476
H  -0.351106 -1.152379 1.379958
totalener: -311.17403231 hartree
nucrepener: 383.70186791 hartree
electener: -694.87590023 hartree
oneelecener: -1167.72204023 hartree
twoeener: 472.84614000 hartree
kineticenergy: 310.00417705 hartree
exchangeener: -12.760285476462 hartree
correlationener: -0.946614562425 hartree
xcener: -13.706900038887 hartree
chargesum: 1.0000000
charge: -0.207459 0.167387 -0.203697 0.178456 -0.100833 -0.104222 -0.224357 0.157951 0.173637 -0.236611 0.151258 0.174708 -0.202269 0.022735 0.192316 0.161905 0.157320 0.196248 0.179403 0.190996 0.175128
charge: -0.196649 0.154664 -0.192304 0.149884 -0.068715 -0.064804 -0.212262 0.152830 0.155726 -0.205331 0.145967 0.150450 -0.222776 0.111707 0.160924 0.152472 0.154102 0.172143 0.155719 0.181387 0.164868
qa: -0.2075 0.1674 -0.2037 0.1785 -0.1008 -0.1042 -0.2244 0.1580 0.1736 -0.2366 0.1513 0.1747 -0.2023 0.0227 0.1923 0.1619 0.1573 0.1962 0.1794 0.1910 0.1751
va: 3.8583 0.9720 3.8573 0.9713 3.8517 3.8420 3.9013 0.9701 0.9694 3.8649 0.9717 0.9651 3.9096 3.6396 0.9533 0.9742 0.9720 0.9476 0.9699 0.9622 0.9616
total: -311.857580733 hartree
energy: -311.857580733001
dipole: 0.56021 -0.88104 -0.32083 1.86445 -1.41465 0.44980 0.17048 -0.34402 -0.17354
magnitude: 0.57911 au
magnitude: 1.47199 debye
