program: Orca
programVersion: 5.0.3
elementType: C H C H C C C H H C H H C C H H H H H H H
charge: 1
multiplicity: 1
keywords: b3lyp def2-TZVP EnGrad RIJCOSX verytightscf def2/J soscf
formula: C8H13
InChI: InChI=1/C8H13/c1-2-4-6-8-7-5-3-1/h1-2,7H,3-6,8H2
21 atoms
C  -2.005951 0.706024 0.085342
H  -2.216379 0.879517 1.144719
C  -1.78011 -0.92201 -0.14057
H  -2.622274 -1.393925 0.369348
C  -0.433509 -1.344577 0.41155
C  0.69938 -1.282376 -0.362172
C  2.010562 -0.685845 0.075342
H  2.224798 -0.881741 1.130834
H  2.858692 -1.016902 -0.527112
C  1.805895 0.906177 -0.141035
H  1.866767 1.134081 -1.210223
H  2.622404 1.426829 0.362557
C  0.429739 1.289837 0.423228
C  -0.725974 1.313884 -0.361502
H  0.530517 -1.201884 -1.440593
H  -1.859102 -1.130171 -1.211326
H  0.031266 0.093472 0.484974
H  -0.574355 1.287383 -1.445038
H  -2.864789 1.001017 -0.519173
H  0.348498 1.526779 1.488672
H  -0.346441 -1.499686 1.489177
totalener: -312.18385496 hartree
nucrepener: 382.13971372 hartree
electener: -694.32356867 hartree
oneelecener: -1164.96159353 hartree
twoeener: 470.63802486 hartree
kineticenergy: 310.48908203 hartree
exchangeener: -36.312775584970 hartree
correlationener: -2.308018214417 hartree
xcener: -38.620793799388 hartree
chargesum: 1.0000000
charge: -0.205070 0.158491 -0.267420 0.174501 -0.071399 -0.029888 -0.202808 0.151590 0.166630 -0.277677 0.162237 0.170450 -0.039255 0.007793 0.140610 0.166478 0.088707 0.159252 0.173632 0.193987 0.179158
charge: -0.189821 0.155408 -0.183766 0.158909 -0.172320 -0.071429 -0.202321 0.152723 0.154912 -0.193423 0.151282 0.155785 -0.172916 -0.014544 0.160473 0.152452 0.299107 0.165820 0.158499 0.172742 0.162428
qa: -0.2051 0.1585 -0.2674 0.1745 -0.0714 -0.0299 -0.2028 0.1516 0.1666 -0.2777 0.1622 0.1704 -0.0393 0.0078 0.1406 0.1665 0.0887 0.1593 0.1736 0.1940 0.1792
va: 3.8387 0.9693 3.9407 0.9662 3.6598 3.8597 3.8445 0.9699 0.9676 3.9463 0.9639 0.9696 3.6007 3.8334 0.9662 0.9639 1.0533 0.9608 0.9655 0.9564 0.9611
energy: -312.183854957822
dipole: -0.00037 -0.18081 -0.18118 0.21090 0.05549 0.26639 0.10961 -0.13494 -0.02532
magnitude: 0.32316 au
magnitude: 0.82141 debye
