program: Orca
programVersion: 5.0.3
elementType: C H C H C C C H H C H H C C H H H H H H H
charge: 1
multiplicity: 1
keywords: DSD-PBEP86/2013 def2-TZVP D3BJ RIJCOSX verytightscf def2-TZVP/C def2/J soscf noTRAH
formula: C8H13
InChI: InChI=1/C8H13/c1-2-4-6-8-7-5-3-1/h1-2,7H,3-6,8H2
21 atoms
C  -2.002607 0.722585 0.080804
H  -2.206275 0.874309 1.144616
C  -1.76289 -0.928799 -0.143872
H  -2.619196 -1.366557 0.373914
C  -0.429752 -1.356097 0.409155
C  0.697827 -1.284529 -0.364014
C  2.00908 -0.687027 0.070879
H  2.222681 -0.879509 1.127658
H  2.859253 -1.021267 -0.527607
C  1.802009 0.898191 -0.143812
H  1.861146 1.132721 -1.211785
H  2.616406 1.42517 0.357158
C  0.425227 1.273029 0.436698
C  -0.741591 1.319262 -0.369844
H  0.530673 -1.208028 -1.443027
H  -1.851279 -1.127632 -1.214413
H  0.070723 0.187981 0.722475
H  -0.600479 1.336402 -1.454927
H  -2.868523 0.993095 -0.52449
H  0.364598 1.68801 1.450572
H  -0.347537 -1.517215 1.486248
totalener: -311.08889961 hartree
nucrepener: 381.40577174 hartree
electener: -692.49467135 hartree
oneelecener: -1162.99185896 hartree
twoeener: 470.49718761 hartree
kineticenergy: 309.96144987 hartree
exchangeener: -14.116922844984 hartree
correlationener: -0.946890263244 hartree
xcener: -15.063813108228 hartree
chargesum: 1.0000000
charge: -0.217992 0.177269 -0.283711 0.189310 -0.087589 -0.112394 -0.197322 0.159252 0.171361 -0.321844 0.167541 0.177353 -0.015556 0.024496 0.147190 0.178020 0.049268 0.189697 0.189882 0.225075 0.190696
charge: -0.181112 0.157650 -0.167422 0.157704 -0.199612 -0.087767 -0.206050 0.149544 0.149844 -0.196745 0.145515 0.151648 -0.203483 0.085427 0.154859 0.150786 0.272310 0.170096 0.158123 0.181673 0.157013
qa: -0.2180 0.1773 -0.2837 0.1893 -0.0876 -0.1124 -0.1973 0.1593 0.1714 -0.3218 0.1675 0.1774 -0.0156 0.0245 0.1472 0.1780 0.0493 0.1897 0.1899 0.2251 0.1907
va: 3.8297 0.9693 3.9629 0.9605 3.6533 3.9357 3.8356 0.9724 0.9705 3.9723 0.9639 0.9701 3.5340 3.7737 0.9666 0.9633 1.1207 0.9519 0.9642 0.9499 0.9603
total: -311.753400487 hartree
dispcorr: -0.014444680 hartree
energy: -311.767845166475
dipole: 0.03019 -0.53031 -0.50011 0.48543 0.23093 0.71636 0.26865 -0.35897 -0.09032
magnitude: 0.87832 au
magnitude: 2.23252 debye
