program: Orca
programVersion: 5.0.3
elementType: C H C H C C C H H C H H C C H H H H H H H
charge: 1
multiplicity: 1
keywords: b3lyp cc-pVTZ EnGrad D3BJ RIJCOSX verytightscf cc-pVTZ/C def2/J soscf
formula: C8H13
InChI: InChI=1/C8H13/c1-2-4-6-8-7-5-3-1/h1-2,7H,3-6,8H2
21 atoms
C  -1.991337 0.553194 0.110274
H  -2.167017 0.738066 1.17437
C  -1.890438 -0.978073 -0.174849
H  -2.66702 -1.543728 0.345651
C  -0.47803 -1.236536 0.315608
C  0.629225 -1.188872 -0.47485
C  1.920148 -0.676294 0.071713
H  2.050411 -0.948512 1.124462
H  2.78755 -1.039293 -0.488137
C  1.853175 0.880683 -0.069529
H  1.926187 1.152044 -1.129502
H  2.703315 1.345629 0.437519
C  0.525393 1.466804 0.507452
C  -0.616443 1.013176 -0.299637
H  0.532233 -1.305776 -1.554449
H  -1.972433 -1.175292 -1.248468
H  0.392244 1.252612 1.571769
H  -0.486253 1.142802 -1.377972
H  -2.775553 1.042744 -0.478585
H  0.596187 2.565033 0.393218
H  -0.338653 -1.212202 1.398033
totalener: -312.23897785 hartree
nucrepener: 382.35027768 hartree
electener: -694.58925552 hartree
oneelecener: -1165.66734089 hartree
twoeener: 471.07808537 hartree
kineticenergy: 309.98072762 hartree
exchangeener: -36.307729510220 hartree
correlationener: -2.305814693688 hartree
xcener: -38.613544203908 hartree
chargesum: 1.0000000
charge: -0.164754 0.145016 -0.165628 0.152645 -0.070415 -0.091235 -0.181606 0.134217 0.152543 -0.186321 0.129939 0.153405 -0.163596 0.015463 0.177341 0.137812 0.140522 0.191499 0.156822 0.177691 0.158638
charge: 0.091853 0.001505 0.095156 -0.001938 0.118686 0.108671 0.078511 -0.001570 0.005280 0.107076 -0.007632 -0.001409 0.071887 0.302210 -0.010190 -0.000992 0.000920 0.006763 0.006043 0.035040 -0.005872
qa: -0.1648 0.1450 -0.1656 0.1526 -0.0704 -0.0912 -0.1816 0.1342 0.1525 -0.1863 0.1299 0.1534 -0.1636 0.0155 0.1773 0.1378 0.1405 0.1915 0.1568 0.1777 0.1586
va: 3.8177 0.9898 3.8424 0.9825 3.7838 3.7896 3.8703 0.9916 0.9832 3.8322 0.9890 0.9800 3.8523 3.5991 0.9821 0.9928 0.9918 0.9791 0.9820 0.9742 0.9932
dispcorr: -0.036742797 hartree
energy: -312.275720644311
dipole: 0.54464 -0.83209 -0.28745 1.88543 -1.30733 0.57810 0.15716 -0.28263 -0.12546
magnitude: 0.65770 au
magnitude: 1.67173 debye
