program: Orca
programVersion: 5.0.3
elementType: C H C H C C C H H C H H C C H H H H H H H
charge: 1
multiplicity: 1
keywords: b3lyp cc-pVTZ EnGrad D3BJ RIJCOSX verytightscf cc-pVTZ/C def2/J soscf
formula: C8H13
InChI: InChI=1/C8H13/c1-2-4-6-8-7-5-3-1/h1-2,7H,3-6,8H2
21 atoms
C  -1.990054 0.575349 0.095461
H  -2.166869 0.75438 1.161619
C  -1.848632 -0.965627 -0.173966
H  -2.656941 -1.508096 0.324161
C  -0.45304 -1.285713 0.340046
C  0.642879 -1.223973 -0.451261
C  1.935482 -0.690686 0.072676
H  2.089711 -0.945078 1.126489
H  2.804098 -1.036618 -0.497383
C  1.83277 0.860538 -0.091529
H  1.883283 1.122486 -1.154874
H  2.673758 1.356827 0.401119
C  0.498557 1.438219 0.511517
C  -0.662231 1.121962 -0.315809
H  0.527869 -1.283846 -1.534836
H  -1.913412 -1.162243 -1.24905
H  0.355978 1.150183 1.556143
H  -0.554564 1.365128 -1.377673
H  -2.806075 1.008187 -0.493693
H  0.620811 2.539222 0.470826
H  -0.324589 -1.298607 1.423709
totalener: -312.23081981 hartree
nucrepener: 380.83062966 hartree
electener: -693.06144947 hartree
oneelecener: -1162.67209332 hartree
twoeener: 469.61064385 hartree
kineticenergy: 309.97448405 hartree
exchangeener: -36.302372086863 hartree
correlationener: -2.304544485232 hartree
xcener: -38.606916572095 hartree
chargesum: 1.0000000
charge: -0.163793 0.148931 -0.167957 0.152205 -0.091574 -0.108317 -0.176529 0.133974 0.151793 -0.186017 0.130599 0.153830 -0.162602 0.044334 0.165206 0.138650 0.141283 0.200673 0.158937 0.181486 0.154888
charge: 0.093609 0.005484 0.096062 -0.001740 0.103145 0.081400 0.076740 -0.002332 0.005302 0.113649 -0.008424 -0.001400 0.075364 0.329824 -0.014349 -0.001084 0.002186 0.011493 0.007946 0.040199 -0.013074
qa: -0.1638 0.1489 -0.1680 0.1522 -0.0916 -0.1083 -0.1765 0.1340 0.1518 -0.1860 0.1306 0.1538 -0.1626 0.0443 0.1652 0.1387 0.1413 0.2007 0.1589 0.1815 0.1549
va: 3.8118 0.9881 3.8493 0.9815 3.7927 3.8012 3.8658 0.9921 0.9831 3.8289 0.9895 0.9798 3.8540 3.5527 0.9863 0.9916 0.9938 0.9729 0.9825 0.9739 0.9938
dispcorr: -0.036640966 hartree
energy: -312.267460774000
dipole: 0.49948 -0.86774 -0.36827 1.93027 -1.05488 0.87539 0.14651 -0.26869 -0.12217
magnitude: 0.95753 au
magnitude: 2.43384 debye
