program: Orca
programVersion: 5.0.3
elementType: C H C H C C C H H C H H C C H H H H H H H
charge: 1
multiplicity: 1
keywords: b3lyp def2-TZVP EnGrad D3BJ RIJCOSX verytightscf def2/J soscf
formula: C8H13
InChI: InChI=1/C8H13/c1-2-4-6-8-7-5-3-1/h1-2,7H,3-6,8H2
21 atoms
C  -1.993404 0.603596 0.083962
H  -2.171306 0.772838 1.152428
C  -1.815345 -0.95462 -0.172091
H  -2.646606 -1.474059 0.31352
C  -0.43384 -1.318501 0.357347
C  0.655401 -1.245669 -0.432319
C  1.95231 -0.700648 0.071934
H  2.125386 -0.942651 1.125605
H  2.819561 -1.034548 -0.507901
C  1.819062 0.84633 -0.105991
H  1.858983 1.104574 -1.170345
H  2.648171 1.365491 0.382961
C  0.474541 1.406079 0.508592
C  -0.698092 1.190346 -0.324504
H  0.523862 -1.251838 -1.516823
H  -1.872763 -1.149399 -1.247766
H  0.321928 1.06235 1.534149
H  -0.606561 1.513009 -1.366677
H  -2.828964 0.991391 -0.507084
H  0.619142 2.506734 0.52605
H  -0.316254 -1.364367 1.440921
totalener: -312.22835089 hartree
nucrepener: 380.02021901 hartree
electener: -692.24856990 hartree
oneelecener: -1161.10826447 hartree
twoeener: 468.85969457 hartree
kineticenergy: 310.52390409 hartree
exchangeener: -36.321927691168 hartree
correlationener: -2.303825322925 hartree
xcener: -38.625753014093 hartree
chargesum: 1.0000000
charge: -0.184484 0.165493 -0.200874 0.165099 -0.131717 -0.087813 -0.206002 0.148079 0.158873 -0.230659 0.147092 0.162868 -0.118556 0.047972 0.144581 0.156849 0.149291 0.200465 0.169822 0.190027 0.153594
charge: -0.193048 0.166583 -0.187774 0.153197 -0.107822 -0.128525 -0.217241 0.152889 0.159398 -0.191268 0.147966 0.153674 -0.209340 0.139643 0.155834 0.154800 0.160176 0.172309 0.163246 0.201994 0.153309
qa: -0.1845 0.1655 -0.2009 0.1651 -0.1317 -0.0878 -0.2060 0.1481 0.1589 -0.2307 0.1471 0.1629 -0.1186 0.0480 0.1446 0.1568 0.1493 0.2005 0.1698 0.1900 0.1536
va: 3.8364 0.9659 3.8309 0.9678 3.8392 3.8003 3.8844 0.9699 0.9703 3.8635 0.9672 0.9639 3.8115 3.5763 0.9679 0.9704 0.9804 0.9448 0.9683 0.9565 0.9665
dispcorr: -0.036538909 hartree
energy: -312.264889801124
dipole: 0.44462 -0.89998 -0.45536 1.96555 -0.86476 1.10079 0.14883 -0.27089 -0.12206
magnitude: 1.19749 au
magnitude: 3.04378 debye
