program: Orca
programVersion: 5.0.3
elementType: C H C H C C C H H C H H C C H H H H H H H
charge: 1
multiplicity: 1
keywords: DSD-PBEP86 cc-pVTZ EnGrad RIJCOSX verytightscf cc-pVTZ/C def2/J soscf
formula: C8H13
InChI: InChI=1/C8H12.H/c1-2-4-6-8-7-5-3-1;/h1-2,7-8H,3-6H2;
21 atoms
C  -1.975895 0.654195 0.123672
H  -2.128938 0.845525 1.190479
C  -1.84993 -0.948827 -0.119685
H  -2.653018 -1.441019 0.431969
C  -0.469466 -1.348259 0.373103
C  0.673167 -1.25893 -0.384773
C  1.975845 -0.654956 0.111444
H  2.132229 -0.855651 1.176088
H  2.844913 -1.012569 -0.443786
C  1.85024 0.949246 -0.116833
H  1.971476 1.172964 -1.181468
H  2.654309 1.437215 0.437225
C  0.470771 1.343457 0.383942
C  -0.674991 1.261303 -0.371854
H  0.550055 -1.266483 -1.471257
H  -1.974319 -1.162023 -1.186031
H  0.000526 0.003063 0.002563
H  -0.554812 1.27493 -1.458288
H  -2.84659 1.015819 -0.426194
H  0.351345 1.334244 1.467929
H  -0.345914 -1.341309 1.460072
totalener: -311.10160506 hartree
nucrepener: 382.90672897 hartree
electener: -694.00833404 hartree
oneelecener: -1165.66846892 hartree
twoeener: 471.66013488 hartree
kineticenergy: 309.66330935 hartree
exchangeener: -12.749398952691 hartree
correlationener: -0.949523731926 hartree
xcener: -13.698922684617 hartree
chargesum: 1.0000000
charge: -0.262186 0.174366 -0.261002 0.189215 -0.061118 -0.060056 -0.261730 0.174264 0.188173 -0.260522 0.173535 0.189113 -0.062193 -0.058763 0.188630 0.173490 0.079355 0.189032 0.188463 0.190970 0.188965
charge: 0.109736 -0.003049 0.109731 0.002325 0.138268 0.139491 0.109267 -0.003035 0.002269 0.110029 -0.003069 0.002432 0.141009 0.141537 0.003618 -0.003199 -0.010427 0.003978 0.002288 0.002748 0.004053
qa: -0.2622 0.1744 -0.2610 0.1892 -0.0611 -0.0601 -0.2617 0.1743 0.1882 -0.2605 0.1735 0.1891 -0.0622 -0.0588 0.1886 0.1735 0.0794 0.1890 0.1885 0.1910 0.1890
va: 3.9042 0.9806 3.9025 0.9725 3.8039 3.8050 3.9044 0.9806 0.9732 3.9021 0.9814 0.9726 3.8028 3.8036 0.9816 0.9814 1.1543 0.9816 0.9731 0.9810 0.9816
energy: -311.817474414908
dipole: 0.00139 -0.00265 -0.00126 0.00760 0.00321 0.01082 0.00074 -0.00213 -0.00139
magnitude: 0.01098 au
magnitude: 0.02790 debye
