program: Orca
programVersion: 5.0.3
elementType: C H C H C C C H H C H H C C H H H H H H H
charge: 1
multiplicity: 1
keywords: DSD-PBEP86/2013 cc-pVTZ EnGrad D3BJ RIJCOSX verytightscf cc-pVTZ/C def2/J soscf
formula: C8H13
InChI: InChI=1/C8H13/c1-2-4-6-8-7-5-3-1/h1-2,7H,3-6,8H2
21 atoms
C  -2.004639 0.714479 0.082712
H  -2.213284 0.878254 1.143862
C  -1.771048 -0.924877 -0.142124
H  -2.620135 -1.379704 0.37236
C  -0.431351 -1.350299 0.41063
C  0.698874 -1.28403 -0.363151
C  2.009933 -0.686495 0.072795
H  2.224141 -0.880609 1.128901
H  2.859107 -1.018869 -0.527809
C  1.803907 0.90212 -0.142643
H  1.863715 1.133448 -1.211237
H  2.619405 1.426035 0.359416
C  0.427201 1.281293 0.430027
C  -0.734129 1.317304 -0.365374
H  0.530875 -1.205882 -1.441936
H  -1.855518 -1.129438 -1.212525
H  0.050333 0.140951 0.605048
H  -0.586565 1.307284 -1.449792
H  -2.866285 0.996751 -0.52358
H  0.356121 1.605988 1.473548
H  -0.346998 -1.51101 1.487682
totalener: -311.08436855 hartree
nucrepener: 381.77307464 hartree
electener: -692.85744319 hartree
oneelecener: -1163.63059468 hartree
twoeener: 470.77315149 hartree
kineticenergy: 309.66363320 hartree
exchangeener: -14.113011293265 hartree
correlationener: -0.947376289258 hartree
xcener: -15.060387582523 hartree
chargesum: 1.0000000
charge: -0.245554 0.178981 -0.278129 0.190357 -0.101139 -0.076630 -0.241565 0.166311 0.182107 -0.269613 0.167838 0.183693 -0.126647 0.013034 0.176331 0.176546 0.105071 0.196161 0.193388 0.211619 0.197837
charge: 0.111379 0.001269 0.124190 0.003579 0.068492 0.132456 0.092701 -0.003504 -0.000480 0.115548 -0.007357 -0.000830 0.108113 0.230115 -0.006514 -0.005139 0.003674 0.007977 0.004919 0.022900 -0.003486
qa: -0.2456 0.1790 -0.2781 0.1904 -0.1011 -0.0766 -0.2416 0.1663 0.1821 -0.2696 0.1678 0.1837 -0.1266 0.0130 0.1763 0.1765 0.1051 0.1962 0.1934 0.2116 0.1978
va: 3.8766 0.9796 3.9384 0.9716 3.8036 3.8259 3.8871 0.9837 0.9733 3.9251 0.9831 0.9765 3.7978 3.7270 0.9800 0.9793 1.1043 0.9734 0.9713 0.9760 0.9778
dispcorr: -0.014453828 hartree
energy: -311.784252145971
dipole: 0.01399 -0.31456 -0.30056 0.34078 0.07806 0.41884 0.19135 -0.21335 -0.02200
magnitude: 0.51600 au
magnitude: 1.31156 debye
