program: Orca
programVersion: 5.0.3
elementType: C H C H C C C H H C H H C C H H H H H H H
charge: 1
multiplicity: 1
keywords: PBE0 cc-pVTZ EnGrad RIJCOSX verytightscf cc-pVTZ/C def2/J soscf
formula: C8H13
InChI: InChI=1/C8H13/c1-2-4-6-8-7-5-3-1/h1-2,7H,3-6,8H2
21 atoms
C  -1.999505 0.521185 0.113332
H  -2.182929 0.728382 1.170986
C  -1.984345 -1.008092 -0.161191
H  -2.679588 -1.602931 0.432279
C  -0.535619 -1.096274 0.27446
C  0.598386 -1.090107 -0.514615
C  1.904013 -0.638622 0.055082
H  1.997855 -0.956729 1.098841
H  2.747051 -1.045485 -0.509467
C  1.918473 0.928281 -0.018234
H  2.077538 1.239058 -1.057198
H  2.755255 1.317376 0.567697
C  0.568012 1.476978 0.482474
C  -0.518642 0.744065 -0.249381
H  0.518562 -1.283964 -1.583688
H  -2.115776 -1.23619 -1.222679
H  0.456175 1.382488 1.56782
H  -0.407119 0.821457 -1.334242
H  -2.682661 1.114409 -0.501041
H  0.488028 2.545838 0.236148
H  -0.380201 -1.049322 1.353155
totalener: -312.08570536 hartree
nucrepener: 386.92525414 hartree
electener: -699.01095950 hartree
oneelecener: -1174.63453287 hartree
twoeener: 475.62357337 hartree
kineticenergy: 309.66723348 hartree
exchangeener: -34.177779249125 hartree
correlationener: -1.977294544739 hartree
xcener: -36.155073793863 hartree
chargesum: 1.0000000
charge: -0.152659 0.143360 -0.173054 0.156180 -0.033429 -0.027606 -0.185351 0.141744 0.157025 -0.199359 0.141001 0.152652 -0.167644 -0.085570 0.194229 0.142577 0.137637 0.168446 0.153907 0.164674 0.171241
charge: 0.104738 0.000478 0.107003 -0.000619 0.116430 0.178556 0.085552 0.003650 0.008118 0.097659 -0.004823 0.001023 0.066199 0.194285 0.005015 0.000205 -0.001441 0.004613 -0.000686 0.019977 0.014067
qa: -0.1527 0.1434 -0.1731 0.1562 -0.0334 -0.0276 -0.1854 0.1417 0.1570 -0.1994 0.1410 0.1527 -0.1676 -0.0856 0.1942 0.1426 0.1376 0.1684 0.1539 0.1647 0.1712
va: 3.8559 0.9956 3.8735 0.9877 3.7928 3.7676 3.9027 0.9925 0.9877 3.8796 0.9890 0.9857 3.8713 3.7660 0.9766 0.9960 0.9938 0.9943 0.9860 0.9810 0.9936
energy: -312.085705363352
dipole: 0.55495 -0.66544 -0.11049 1.84815 -1.87593 -0.02778 0.20473 -0.36897 -0.16424
magnitude: 0.19989 au
magnitude: 0.50807 debye
