program: Orca
programVersion: 5.0.3
elementType: C H C H C C C H H C H H C C H H H H H H H
charge: 1
multiplicity: 1
keywords: PBE0 def2-TZVP EnGrad RIJCOSX verytightscf def2/J soscf
formula: C8H13
InChI: InChI=1/C8H13/c1-2-4-6-8-7-5-3-1/h1-2,7H,3-6,8H2
21 atoms
C  -2.004639 0.714479 0.082712
H  -2.213284 0.878254 1.143862
C  -1.771048 -0.924877 -0.142124
H  -2.620135 -1.379704 0.37236
C  -0.431351 -1.350299 0.41063
C  0.698874 -1.28403 -0.363151
C  2.009933 -0.686495 0.072795
H  2.224141 -0.880609 1.128901
H  2.859107 -1.018869 -0.527809
C  1.803907 0.90212 -0.142643
H  1.863715 1.133448 -1.211237
H  2.619405 1.426035 0.359416
C  0.427201 1.281293 0.430027
C  -0.734129 1.317304 -0.365374
H  0.530875 -1.205882 -1.441936
H  -1.855518 -1.129438 -1.212525
H  0.050333 0.140951 0.605048
H  -0.586565 1.307284 -1.449792
H  -2.866285 0.996751 -0.52358
H  0.356121 1.605988 1.473548
H  -0.346998 -1.51101 1.487682
totalener: -312.01370738 hartree
nucrepener: 381.77307464 hartree
electener: -693.78678202 hartree
oneelecener: -1164.26587663 hartree
twoeener: 470.47909461 hartree
kineticenergy: 310.11635064 hartree
exchangeener: -34.159118041224 hartree
correlationener: -1.972449706711 hartree
xcener: -36.131567747936 hartree
chargesum: 1.0000000
charge: -0.213465 0.173794 -0.295885 0.188801 -0.050545 -0.076729 -0.210035 0.163471 0.175429 -0.313519 0.173667 0.180811 0.009756 -0.011693 0.146258 0.180333 0.027289 0.170200 0.187464 0.207557 0.187040
charge: -0.192802 0.160782 -0.183351 0.163748 -0.187737 -0.079670 -0.212337 0.156279 0.157207 -0.201171 0.154154 0.158823 -0.190578 0.008696 0.162209 0.156451 0.290446 0.169732 0.162842 0.181430 0.164848
qa: -0.2135 0.1738 -0.2959 0.1888 -0.0505 -0.0767 -0.2100 0.1635 0.1754 -0.3135 0.1737 0.1808 0.0098 -0.0117 0.1463 0.1803 0.0273 0.1702 0.1875 0.2076 0.1870
va: 3.8886 0.9689 4.0298 0.9622 3.7128 3.9964 3.8934 0.9706 0.9686 4.0356 0.9632 0.9682 3.6194 3.9431 0.9664 0.9627 1.1396 0.9593 0.9644 0.9553 0.9610
energy: -312.013707379488
dipole: 0.01399 -0.30861 -0.29462 0.34078 0.06450 0.40528 0.19135 -0.21943 -0.02808
magnitude: 0.50183 au
magnitude: 1.27556 debye
