program: Orca
programVersion: 5.0.3
elementType: C H C H C C C H H C H H C C H H H H H H H
charge: 1
multiplicity: 1
keywords: DSD-PBEP86/2013 cc-pVTZ EnGrad D3BJ RIJCOSX verytightscf cc-pVTZ/C def2/J soscf
formula: C8H13
InChI: InChI=1/C8H13/c1-2-4-6-8-7-5-3-1/h1-2,7H,3-6,8H2
21 atoms
C  -1.998124 0.527817 0.119517
H  -2.176749 0.722631 1.180477
C  -1.961788 -0.999351 -0.169071
H  -2.676489 -1.593785 0.40207
C  -0.521676 -1.130024 0.279847
C  0.60821 -1.116763 -0.506095
C  1.906505 -0.649218 0.063533
H  2.004727 -0.952739 1.111208
H  2.759547 -1.045249 -0.493972
C  1.899531 0.916307 -0.032579
H  2.031601 1.212023 -1.079939
H  2.74543 1.325679 0.525865
C  0.559817 1.481004 0.488444
C  -0.542245 0.807217 -0.260442
H  0.529286 -1.2975 -1.577657
H  -2.080051 -1.211561 -1.235668
H  0.444883 1.3653 1.571132
H  -0.419135 0.872084 -1.344526
H  -2.709847 1.102581 -0.481267
H  0.516269 2.559145 0.266911
H  -0.370805 -1.079156 1.359345
totalener: -311.16947875 hartree
nucrepener: 385.79197407 hartree
electener: -696.96145282 hartree
oneelecener: -1171.81714826 hartree
twoeener: 474.85569544 hartree
kineticenergy: 309.74587337 hartree
exchangeener: -14.127791726256 hartree
correlationener: -0.948093388195 hartree
xcener: -15.075885114451 hartree
chargesum: 1.0000000
charge: -0.215459 0.167131 -0.234227 0.183344 -0.061212 -0.060511 -0.249178 0.163824 0.182631 -0.247395 0.159243 0.181310 -0.232243 -0.067112 0.223652 0.166797 0.162670 0.200679 0.182094 0.195532 0.198431
charge: 0.097947 -0.000225 0.102040 -0.000898 0.125682 0.166715 0.082637 0.001433 0.006530 0.097671 -0.006329 -0.000237 0.064946 0.226496 0.002198 -0.000340 -0.001625 0.002618 0.000552 0.022412 0.009777
qa: -0.2155 0.1671 -0.2342 0.1833 -0.0612 -0.0605 -0.2492 0.1638 0.1826 -0.2474 0.1592 0.1813 -0.2322 -0.0671 0.2237 0.1668 0.1627 0.2007 0.1821 0.1955 0.1984
va: 3.8656 0.9862 3.8849 0.9769 3.7984 3.7854 3.9202 0.9842 0.9766 3.8909 0.9817 0.9729 3.8963 3.7371 0.9607 0.9865 0.9844 0.9772 0.9751 0.9680 0.9781
dispcorr: -0.013815371 hartree
energy: -311.858021987499
dipole: 0.56102 -0.72199 -0.16096 1.85290 -1.79061 0.06229 0.19100 -0.34756 -0.15656
magnitude: 0.23302 au
magnitude: 0.59230 debye
