program: Orca
programVersion: 5.0.3
elementType: C H C H C C C H H C H H C C H H H H H H H
charge: 1
multiplicity: 1
keywords: m062x def2-TZVP EnGrad RIJCOSX verytightscf def2/J soscf
formula: C8H13
InChI: InChI=1/C8H13/c1-2-4-6-8-7-5-3-1/h1-2,7H,3-6,8H2
21 atoms
C  -1.996704 0.532596 0.120007
H  -2.173758 0.723856 1.18198
C  -1.946693 -0.994356 -0.171541
H  -2.674962 -1.584656 0.387249
C  -0.512365 -1.154205 0.285966
C  0.613024 -1.133165 -0.500426
C  1.908489 -0.655441 0.066457
H  2.012124 -0.951945 1.115629
H  2.766164 -1.043977 -0.48953
C  1.888343 0.908652 -0.040395
H  2.005624 1.197804 -1.091488
H  2.737528 1.33018 0.50399
C  0.553603 1.481539 0.492915
C  -0.557641 0.851109 -0.269131
H  0.532133 -1.303606 -1.573597
H  -2.05699 -1.200573 -1.240358
H  0.434758 1.348633 1.572998
H  -0.427801 0.913687 -1.352502
H  -2.725754 1.091561 -0.475827
H  0.535185 2.565455 0.291178
H  -0.363521 -1.103872 1.365964
totalener: -312.31304483 hartree
nucrepener: 385.01024815 hartree
electener: -697.32329298 hartree
oneelecener: -1170.68084104 hartree
twoeener: 473.35754807 hartree
kineticenergy: 310.40040654 hartree
xcener: -23.106696516608 hartree
chargesum: 1.0000000
charge: -0.273911 0.201904 -0.285934 0.201588 -0.080483 -0.051487 -0.332370 0.203052 0.203349 -0.303735 0.200792 0.200170 -0.294668 -0.048475 0.214662 0.198812 0.195586 0.226347 0.200899 0.219224 0.204677
charge: -0.202454 0.159012 -0.195859 0.155359 -0.063444 -0.045386 -0.215747 0.160350 0.163495 -0.213855 0.153288 0.156847 -0.231731 0.044082 0.167000 0.158167 0.158848 0.174536 0.158884 0.185624 0.172983
qa: -0.2739 0.2019 -0.2859 0.2016 -0.0805 -0.0515 -0.3324 0.2031 0.2033 -0.3037 0.2008 0.2002 -0.2947 -0.0485 0.2147 0.1988 0.1956 0.2263 0.2009 0.2192 0.2047
va: 3.7374 0.9551 3.7438 0.9628 3.6989 3.6291 3.7686 0.9467 0.9584 3.7021 0.9465 0.9566 3.7398 3.5427 0.9457 0.9545 0.9525 0.9330 0.9607 0.9472 0.9468
energy: -312.313044825656
dipole: 0.56296 -0.75538 -0.19242 1.85581 -1.64285 0.21296 0.18322 -0.33374 -0.15052
magnitude: 0.32409 au
magnitude: 0.82376 debye
