program: Orca
programVersion: 5.0.3
elementType: C H C H C C C H H C H H C C H H H H H H H
charge: 1
multiplicity: 1
keywords: b3lyp def2-TZVP EnGrad RIJCOSX verytightscf def2/J soscf
formula: C8H13
InChI: InChI=1/C8H13/c1-2-4-6-8-7-5-3-1/h1-2,7H,3-6,8H2
21 atoms
C  -2.004639 0.714479 0.082712
H  -2.213284 0.878254 1.143862
C  -1.771048 -0.924877 -0.142124
H  -2.620135 -1.379704 0.37236
C  -0.431351 -1.350299 0.41063
C  0.698874 -1.28403 -0.363151
C  2.009933 -0.686495 0.072795
H  2.224141 -0.880609 1.128901
H  2.859107 -1.018869 -0.527809
C  1.803907 0.90212 -0.142643
H  1.863715 1.133448 -1.211237
H  2.619405 1.426035 0.359416
C  0.427201 1.281293 0.430027
C  -0.734129 1.317304 -0.365374
H  0.530875 -1.205882 -1.441936
H  -1.855518 -1.129438 -1.212525
H  0.050333 0.140951 0.605048
H  -0.586565 1.307284 -1.449792
H  -2.866285 0.996751 -0.52358
H  0.356121 1.605988 1.473548
H  -0.346998 -1.51101 1.487682
totalener: -312.18346210 hartree
nucrepener: 381.77307464 hartree
electener: -693.95653674 hartree
oneelecener: -1164.29002637 hartree
twoeener: 470.33348962 hartree
kineticenergy: 310.49066883 hartree
exchangeener: -36.311866041579 hartree
correlationener: -2.307427616234 hartree
xcener: -38.619293657813 hartree
chargesum: 1.0000000
charge: -0.202422 0.161775 -0.273153 0.176569 -0.057007 -0.048510 -0.198400 0.150878 0.164502 -0.292575 0.162232 0.168817 -0.001748 0.009216 0.138263 0.168775 0.048622 0.166265 0.175826 0.201671 0.180405
charge: -0.185630 0.157010 -0.176747 0.160394 -0.181785 -0.074551 -0.205004 0.152392 0.153809 -0.194677 0.150225 0.155300 -0.185246 0.012073 0.158584 0.152689 0.286264 0.166470 0.159542 0.177556 0.161330
qa: -0.2024 0.1618 -0.2732 0.1766 -0.0570 -0.0485 -0.1984 0.1509 0.1645 -0.2926 0.1622 0.1688 -0.0017 0.0092 0.1383 0.1688 0.0486 0.1663 0.1758 0.2017 0.1804
va: 3.8302 0.9686 3.9465 0.9642 3.6313 3.8762 3.8358 0.9699 0.9685 3.9548 0.9628 0.9700 3.5506 3.8185 0.9665 0.9628 1.0847 0.9584 0.9651 0.9546 0.9608
energy: -312.183462099029
dipole: 0.01399 -0.31027 -0.29628 0.34078 0.05936 0.40013 0.19135 -0.21811 -0.02676
magnitude: 0.49860 au
magnitude: 1.26735 debye
