program: Orca
programVersion: 5.0.3
elementType: C H C H C C C H H C H H C C H H H H H H H
charge: 1
multiplicity: 1
keywords: PBE0 def2-TZVP EnGrad RIJCOSX verytightscf def2/J soscf
formula: C8H13
InChI: InChI=1/C8H13/c1-2-4-6-8-7-5-3-1/h1-2,7H,3-6,8H2
21 atoms
C  -1.997427 0.530175 0.119988
H  -2.175172 0.722971 1.181514
C  -1.954241 -0.996803 -0.170454
H  -2.675724 -1.589381 0.394366
C  -0.517017 -1.142136 0.282753
C  0.610695 -1.125062 -0.503295
C  1.907451 -0.652386 0.065141
H  2.008244 -0.952295 1.113617
H  2.762947 -1.044646 -0.491417
C  1.893823 0.912461 -0.036545
H  2.018285 1.204706 -1.085886
H  2.74157 1.327974 0.514583
C  0.556779 1.481499 0.490676
C  -0.549944 0.829118 -0.264756
H  0.530958 -1.30084 -1.575655
H  -2.068496 -1.205737 -1.238231
H  0.439955 1.357449 1.572137
H  -0.423218 0.892045 -1.348485
H  -2.71797 1.097253 -0.478061
H  0.525787 2.562603 0.278786
H  -0.367182 -1.091157 1.362491
totalener: -312.08512755 hartree
nucrepener: 385.39946110 hartree
electener: -697.48458866 hartree
oneelecener: -1171.68726096 hartree
twoeener: 474.20267231 hartree
kineticenergy: 310.17627604 hartree
exchangeener: -34.189003322822 hartree
correlationener: -1.974122517883 hartree
xcener: -36.163125840705 hartree
chargesum: 1.0000000
charge: -0.191119 0.162668 -0.194781 0.176944 -0.062112 -0.062243 -0.222004 0.161544 0.177115 -0.242736 0.157075 0.176176 -0.182562 -0.078079 0.195137 0.159123 0.151533 0.183173 0.176269 0.186228 0.172650
charge: -0.200981 0.158710 -0.194327 0.155387 -0.061403 -0.038532 -0.213227 0.160791 0.164343 -0.213591 0.153466 0.157197 -0.230657 0.026002 0.167930 0.158140 0.158019 0.175079 0.158396 0.184375 0.174882
qa: -0.1911 0.1627 -0.1948 0.1769 -0.0621 -0.0622 -0.2220 0.1615 0.1771 -0.2427 0.1571 0.1762 -0.1826 -0.0781 0.1951 0.1591 0.1515 0.1832 0.1763 0.1862 0.1726
va: 3.9250 0.9748 3.9198 0.9705 3.9218 3.8803 3.9605 0.9677 0.9681 3.9439 0.9697 0.9645 3.9624 3.8727 0.9503 0.9740 0.9734 0.9550 0.9693 0.9635 0.9624
energy: -312.085127554162
dipole: 0.56226 -0.72076 -0.15850 1.85430 -1.71233 0.14197 0.18704 -0.33498 -0.14793
magnitude: 0.25916 au
magnitude: 0.65873 debye
