program: Orca
programVersion: 5.0.3
elementType: C H C H C C C H H C H H C C H H H H H H H
charge: 1
multiplicity: 1
keywords: DSD-PBEP86 def2-TZVP RIJCOSX verytightscf def2-TZVP/C def2/J soscf noTRAH
formula: C8H13
InChI: InChI=1/C8H13/c1-2-4-6-8-7-5-3-1/h1-2,7H,3-6,8H2
21 atoms
C  -1.998455 0.526662 0.119076
H  -2.177613 0.722737 1.179689
C  -1.965562 -1.000671 -0.168233
H  -2.67689 -1.595828 0.406205
C  -0.524007 -1.124004 0.278537
C  0.606881 -1.112528 -0.507481
C  1.906063 -0.647581 0.062583
H  2.003131 -0.953033 1.109803
H  2.757755 -1.045503 -0.495571
C  1.902481 0.918249 -0.030518
H  2.038547 1.215889 -1.076781
H  2.747279 1.324483 0.531841
C  0.561284 1.48059 0.487342
C  -0.538385 0.796335 -0.258334
H  0.528213 -1.295616 -1.578647
H  -2.085862 -1.214778 -1.234173
H  0.44721 1.368859 1.570588
H  -0.41722 0.86268 -1.342589
H  -2.705639 1.105076 -0.483318
H  0.511485 2.557203 0.261198
H  -0.37258 -1.073463 1.357919
totalener: -311.18272477 hartree
nucrepener: 385.98833548 hartree
electener: -697.17106025 hartree
oneelecener: -1172.22830664 hartree
twoeener: 475.05724639 hartree
kineticenergy: 310.01966077 hartree
exchangeener: -12.764247831601 hartree
correlationener: -0.948760660557 hartree
xcener: -13.713008492158 hartree
chargesum: 1.0000000
charge: -0.199986 0.164462 -0.198309 0.178696 -0.079993 -0.055894 -0.224968 0.159532 0.177546 -0.237918 0.152652 0.173986 -0.208724 -0.034302 0.205105 0.160005 0.150794 0.180622 0.175589 0.180698 0.180406
charge: -0.189657 0.152832 -0.184044 0.149397 -0.061553 -0.013988 -0.204517 0.154820 0.157102 -0.206600 0.146279 0.150586 -0.223791 0.037224 0.165613 0.151963 0.151257 0.171702 0.150621 0.172410 0.172344
qa: -0.2000 0.1645 -0.1983 0.1787 -0.0800 -0.0559 -0.2250 0.1595 0.1775 -0.2379 0.1527 0.1740 -0.2087 -0.0343 0.2051 0.1600 0.1508 0.1806 0.1756 0.1807 0.1804
va: 3.8688 0.9740 3.8708 0.9722 3.8492 3.7968 3.9048 0.9684 0.9682 3.8738 0.9714 0.9671 3.9202 3.7194 0.9458 0.9740 0.9727 0.9568 0.9710 0.9659 0.9600
total: -311.867520918 hartree
energy: -311.867520917503
dipole: 0.56023 -0.73516 -0.17493 1.85220 -1.79342 0.05878 0.19305 -0.38344 -0.19039
magnitude: 0.26515 au
magnitude: 0.67396 debye
