program: Orca
programVersion: 5.0.3
elementType: C H C H C C C H H C H H C C H H H H H H H
charge: 1
multiplicity: 1
keywords: DSD-PBEP86/2013 cc-pVTZ EnGrad RIJCOSX verytightscf cc-pVTZ/C def2/J soscf
formula: C8H13
InChI: InChI=1/C8H13/c1-2-4-6-8-7-5-3-1/h1-2,7H,3-6,8H2
21 atoms
C  -1.995221 0.537615 0.118954
H  -2.171306 0.726678 1.181607
C  -1.931618 -0.989711 -0.1731
H  -2.67332 -1.574543 0.374354
C  -0.503093 -1.177802 0.293083
C  0.617421 -1.148855 -0.494371
C  1.910879 -0.661294 0.068492
H  2.0208 -0.951276 1.118854
H  2.772209 -1.042598 -0.487237
C  1.877982 0.901107 -0.0480
H  1.981933 1.184825 -1.102089
H  2.72902 1.334438 0.484306
C  0.546851 1.480223 0.497311
C  -0.573104 0.895092 -0.277865
H  0.533382 -1.307423 -1.56921
H  -2.03409 -1.191814 -1.243662
H  0.423874 1.328138 1.574178
H  -0.438927 0.962746 -1.360449
H  -2.740441 1.07935 -0.473624
H  0.553423 2.569211 0.317208
H  -0.356299 -1.130963 1.373666
totalener: -311.17249786 hartree
nucrepener: 384.25037793 hartree
electener: -695.42287579 hartree
oneelecener: -1168.76680881 hartree
twoeener: 473.34393302 hartree
kineticenergy: 309.73122258 hartree
exchangeener: -12.758019864120 hartree
correlationener: -0.946790027072 hartree
xcener: -13.704809891192 hartree
chargesum: 1.0000000
charge: -0.226279 0.171721 -0.233824 0.185121 -0.078083 -0.092766 -0.251580 0.165983 0.184077 -0.251501 0.160085 0.184078 -0.237201 -0.038904 0.223537 0.168357 0.169040 0.211138 0.185228 0.202843 0.198930
charge: 0.090468 0.001190 0.095112 -0.000158 0.126623 0.140790 0.077640 0.000986 0.006690 0.097838 -0.005858 0.000127 0.063543 0.263720 -0.001834 0.000543 0.000631 0.004498 0.004013 0.028824 0.004615
qa: -0.2263 0.1717 -0.2338 0.1851 -0.0781 -0.0928 -0.2516 0.1660 0.1841 -0.2515 0.1601 0.1841 -0.2372 -0.0389 0.2235 0.1684 0.1690 0.2111 0.1852 0.2028 0.1989
va: 3.8681 0.9841 3.8880 0.9757 3.8109 3.8099 3.9217 0.9838 0.9759 3.8912 0.9812 0.9715 3.9039 3.7016 0.9611 0.9860 0.9826 0.9702 0.9743 0.9659 0.9769
energy: -311.875835608405
dipole: 0.56251 -0.78374 -0.22122 1.85977 -1.59747 0.26229 0.17592 -0.31754 -0.14162
magnitude: 0.37121 au
magnitude: 0.94353 debye
