program: Orca
programVersion: 5.0.3
elementType: C H C H C C C H H C H H C C H H H H H H H
charge: 1
multiplicity: 1
keywords: DSD-PBEP86/2013 def2-TZVP D3BJ RIJCOSX verytightscf def2-TZVP/C def2/J soscf noTRAH
formula: C8H13
InChI: InChI=1/C8H13/c1-2-4-6-8-7-5-3-1/h1-2,7H,3-6,8H2
21 atoms
C  -1.997926 0.759291 0.070889
H  -2.164458 0.836829 1.148079
C  -1.731325 -0.96264 -0.156072
H  -2.618362 -1.316235 0.373912
C  -0.418395 -1.385261 0.39445
C  0.687402 -1.27807 -0.375163
C  2.002441 -0.690367 0.06334
H  2.211622 -0.88548 1.120773
H  2.856399 -1.033097 -0.52671
C  1.790388 0.863746 -0.142016
H  1.835403 1.121821 -1.205643
H  2.594731 1.410501 0.356915
C  0.421701 1.256836 0.484816
C  -0.767445 1.304256 -0.376313
H  0.523296 -1.205301 -1.454993
H  -1.835898 -1.124823 -1.229258
H  0.178846 0.532003 1.269922
H  -0.657747 1.565464 -1.432495
H  -2.881311 0.988865 -0.523431
H  0.4551 2.202285 1.062891
H  -0.337896 -1.491473 1.476051
totalener: -311.11953758 hartree
nucrepener: 379.62611325 hartree
electener: -690.74565083 hartree
oneelecener: -1159.68103549 hartree
twoeener: 468.93538465 hartree
kineticenergy: 310.01448577 hartree
exchangeener: -14.120443348573 hartree
correlationener: -0.943278140028 hartree
xcener: -15.063721488601 hartree
chargesum: 1.0000000
charge: -0.270271 0.199646 -0.199572 0.193794 -0.208863 -0.107530 -0.214633 0.155261 0.165576 -0.275019 0.153028 0.168966 -0.142021 0.104127 0.140444 0.186531 0.145983 0.212918 0.195956 0.220388 0.175291
charge: -0.166890 0.168199 -0.114584 0.158718 -0.191803 -0.118534 -0.213504 0.148188 0.147486 -0.201853 0.141443 0.150289 -0.211878 0.149763 0.150951 0.152903 0.178739 0.173275 0.158129 0.192339 0.148626
qa: -0.2703 0.1996 -0.1996 0.1938 -0.2089 -0.1075 -0.2146 0.1553 0.1656 -0.2750 0.1530 0.1690 -0.1420 0.1041 0.1404 0.1865 0.1460 0.2129 0.1960 0.2204 0.1753
va: 3.8704 0.9585 3.8371 0.9566 3.8377 3.8564 3.8686 0.9718 0.9739 3.9080 0.9691 0.9691 3.7474 3.5532 0.9682 0.9591 1.0052 0.9461 0.9648 0.9418 0.9624
total: -311.774866076 hartree
dispcorr: -0.014248234 hartree
energy: -311.789114310451
dipole: 0.14952 -1.06118 -0.91166 1.49943 -0.29567 1.20376 0.40836 -0.57509 -0.16673
magnitude: 1.51920 au
magnitude: 3.86149 debye
