program: Gaussian 09
title: 000051239
version: EM64L-G09RevD.01
frameworkgroup: C1[X(C17H17N5S)]
method: RPBEPBE
basis: SDD
operation: Freq
keyword: #p
keyword: freq=noraman
keyword: PBEPBE/SDD
title: #p freq=noraman PBEPBE/SDD
converged: YES YES NO NO
title: Mulliken charges:
elementType: S N N N N N C C C C C C C C C C C C C C C C C H H H H H H H H H H H H H H H H H
charge: 0.257823 -0.111565 -0.501306 -0.387254 -0.057420 -0.158771 -0.269514 -0.542586 -0.489321 0.244056 0.363063 0.218347 -0.426341 -0.082309 0.128536 -0.328211 -0.113741 -0.330661 -0.291337 -0.231517 -0.793877 -0.495573 -0.121498 0.268264 0.254761 0.239455 0.232788 0.250608 0.406722 0.367567 0.321061 0.228477 0.261238 0.221988 0.228134 0.249126 0.227046 0.225779 0.274942 0.263019
chargesum: 0.00000
title: Mulliken charges with hydrogens summed into heavy atoms:
elementType: S N N N N N C C C C C C C C C C C C C C C C C
charge: 0.257823 -0.111565 -0.094584 -0.019687 -0.057420 -0.158771 -0.001249 -0.048370 -0.005925 0.244056 0.363063 0.218347 -0.105280 -0.082309 0.128536 -0.099734 -0.113741 -0.069423 -0.069349 -0.003383 -0.091925 -0.220631 0.141521
polarizability: 3.29427618e+02 -3.70622919e+00 3.37542269e+02 5.58334914e-01 -6.70804348e+00 1.07123096e+02
1716.lowfreq: -5.7195 -0.0008 -0.0008 0.0013 0.7196 5.4371 20.4023 34.8961 44.7030
frequency: 20.3566 34.8752 44.6871 61.1895 64.8299 68.1491 91.8023 99.4904 113.1165 134.4311 160.0369 180.6610 200.7001 227.9213 244.9650 262.0544 279.8405 309.1282 313.7276 415.7495 432.0334 441.4666 466.0565 480.9351 493.2107 521.9800 524.8910 533.9059 586.5537 591.7228 600.7680 617.3955 639.4792 659.6239 673.4473 680.8739 688.3972 701.0222 747.3067 765.6989 782.2703 787.2836 788.8527 807.8541 814.1278 845.1074 861.8688 863.9353 867.1938 890.7117 900.8534 915.6663 943.6876 960.3648 968.2977 991.4523 993.8831 1010.6362 1030.7809 1038.7234 1043.2552 1046.7169 1065.7454 1081.3521 1095.8033 1106.1029 1127.8039 1138.6691 1170.4397 1175.1685 1192.5571 1200.0432 1238.7300 1252.1686 1272.8686 1279.8744 1291.0412 1338.4741 1350.5510 1379.8528 1390.2869 1392.9221 1425.1880 1427.2629 1445.8132 1450.5856 1461.5754 1463.7039 1466.2962 1492.8406 1505.2334 1545.4405 1550.5278 1580.1227 1615.4037 1630.8480 1663.7288 2980.3515 3051.6933 3057.6503 3085.4557 3108.2554 3115.8395 3117.8815 3133.3893 3151.1358 3168.8570 3180.2023 3188.4024 3190.8523 3205.0153 3217.7528 3259.5726 3487.6333
redmass: 4.9759 6.2931 3.1023 4.5437 3.8250 1.2847 3.6612 3.0393 4.8816 4.2239 5.2294 4.7449 6.0989 5.6066 5.4219 5.3308 3.4759 3.6761 4.7177 3.8808 5.6798 3.4483 5.5012 4.0974 4.4093 3.1414 5.5473 6.8278 2.6353 2.2693 4.7783 4.2406 5.4590 3.4078 5.4311 6.4963 3.4484 1.3023 3.1816 1.4483 4.5406 1.3734 2.5935 1.5694 6.8998 4.2556 1.6529 3.6263 1.4849 3.1156 1.2467 3.8847 1.2806 1.3517 3.9617 1.3225 2.1618 2.3560 2.3498 1.2366 2.0329 1.5957 1.1484 1.7428 1.3082 1.9638 1.8031 2.1772 1.3487 1.3431 1.5560 2.0282 2.7887 2.0722 2.4619 1.7355 2.3714 2.2561 2.5565 1.7244 2.7371 4.8917 2.0242 1.1089 1.6174 2.1312 1.3821 1.5016 1.0495 4.7508 3.1172 7.6306 6.5916 4.7841 4.2992 4.4188 1.8203 1.0379 1.0866 1.0970 1.0535 1.0597 1.0983 1.0864 1.0893 1.0948 1.0990 1.0931 1.0831 1.1171 1.0929 1.1160 1.1015 1.0768
irintensity: 0.0019 0.2233 0.3054 0.0123 0.4944 1.2152 0.2028 1.3092 1.1240 0.3734 4.0762 2.8044 3.5369 0.6957 0.8975 3.3673 1.6099 0.7530 2.1881 1.5779 19.2529 5.7811 4.4820 2.1525 0.0633 0.1517 2.0256 13.2927 61.4113 9.1200 13.8172 0.3855 6.2735 0.1391 4.1531 2.9684 52.0905 56.7642 0.9026 56.2944 5.6567 20.3963 14.2569 3.8709 15.3642 1.8498 34.2432 1.7400 3.6427 3.2624 39.4428 9.8245 19.1194 13.7576 8.9109 0.0317 10.4437 2.8084 22.1297 26.0676 35.8311 8.7772 11.0263 2.9349 12.4551 12.1879 11.3205 93.5610 2.5110 6.7514 8.7575 47.9196 8.1117 50.1252 24.1816 4.7104 237.5750 69.3893 96.8021 24.7653 27.0801 31.5915 103.7933 4.1525 220.1426 2.2831 98.2868 1.0157 15.7675 56.9250 11.3005 367.6522 2.8055 625.5769 86.3287 501.9947 368.6130 24.2189 35.0324 20.7829 11.5560 17.4242 14.5875 0.3082 10.8962 26.4951 28.7512 12.1031 419.4421 9.3977 1.4210 22.6561 3.0059 152.6654
temp: 298.150 k
press: 1.00000 atm
elementType: 16 7 7 7 7 7 6 6 6 6 6 6 6 6 6 6 6 6 6 6 6 6 6 1 1 1 1 1 1 1 1 1 1 1 1 1 1 1 1 1
symmnumber: 1
zpe: 815213.0 jmol-1
zpe.correction: 0.310498 hartree
zpe.thermalcorrener: 0.331064 hartree
zpe.thermalcorrenthalpy: 0.332008 hartree
zpe.thermalcorrgfe: 0.259183 hartree
zpe.sumelectzpe: -1328.170671 hartree
zpe.sumelectthermal: -1328.150105 hartree
zpe.sumelectthermalent: -1328.149161 hartree
zpe.sumelectthermalfe: -1328.221986 hartree
dipole: -6.4315 -1.4011 0.0413
dipole: 6.5825
quadrupole: -139.0513 -120.8959 -148.2649
quadrupole: -2.1830 1.5220 -1.5670
quadrupole: -2.9806 15.1748 -12.1942 -2.1830 1.5220 -1.5670
hfenergy: -1328.4811694 hartree
pointgroup: C01 [X(C17H17N5S1)]
dipole: -2.478987 0.6778891 -0.3193146 debye
polarizability: 328.4495043|7.017222|331.7968463|17.4231046|-34.7555473|113.8466318 unknown
InChI: InChI=1S/C17H17N5S/c1-11-10-15(13-4-2-3-5-14(13)19-11)21-16(20-12-6-7-12)22-17-18-8-9-23-17/h2-5,8-10,12,21-22H,6-7H2,1H3
charge 0 multiplicity 1
40 atoms
S  -4.65374 1.796236 -0.5561
N  -1.381819 -2.122371 0.354043
N  -0.328422 0.002546 0.002111
N  -2.692564 -0.163402 -0.105781
N  3.837714 -0.903697 0.467431
N  -1.998609 2.122985 -0.435129
C  -2.624642 -2.859349 0.503061
C  -3.538784 -3.18309 -0.725055
C  -2.695355 -4.276462 -0.042829
C  -1.432789 -0.831894 0.102692
C  1.032193 -0.327634 0.160478
C  2.006523 0.743082 0.020096
C  1.493374 -1.621792 0.443201
C  3.400467 0.387444 0.185686
C  2.898158 -1.866845 0.589445
C  1.674362 2.106755 -0.266929
C  -2.929913 1.173509 -0.343523
C  4.4003 1.403706 0.057138
C  2.673981 3.078244 -0.387184
C  4.048427 2.725932 -0.22436
C  3.381006 -3.270319 0.895463
C  -3.93171 3.439097 -0.77324
C  -2.55798 3.385346 -0.671291
H  -3.147989 -2.68647 1.456273
H  -3.1978 -2.841259 -1.708067
H  -4.62575 -3.208066 -0.592072
H  -3.214932 -5.037083 0.546381
H  -1.811421 -4.628897 -0.580995
H  -0.573276 0.993643 -0.195127
H  -3.480821 -0.81801 -0.133396
H  0.770339 -2.431638 0.549558
H  0.630536 2.415503 -0.397108
H  5.441888 1.094953 0.189235
H  2.401434 4.116457 -0.607465
H  4.823188 3.494604 -0.320789
H  4.478595 -3.274349 0.979619
H  2.946122 -3.643385 1.84186
H  3.079171 -3.976587 0.099107
H  -4.576842 4.294112 -0.957035
H  -1.89512 4.245544 -0.764603
