program: Orca
programVersion: 5.0.3
elementType: C H C H C C C H H C H H C C H H H H H H H
charge: 1
multiplicity: 1
keywords: DSD-PBEP86 cc-pVTZ EnGrad D3BJ RIJCOSX verytightscf cc-pVTZ/C def2/J soscf
formula: C8H13
InChI: InChI=1/C8H13/c1-3-7-5-2-6-8(4-1)9-7/h3,6-8H,1-2,4-5H2
21 atoms
C  -1.994296 0.669128 0.105222
H  -2.185346 0.860704 1.165575
C  -1.8278 -0.933314 -0.13058
H  -2.64357 -1.435579 0.392365
C  -0.455836 -1.336003 0.393402
C  0.686976 -1.270725 -0.368466
C  1.997017 -0.668366 0.094032
H  2.192532 -0.869977 1.151718
H  2.849567 -1.011363 -0.494911
C  1.830081 0.932939 -0.12911
H  1.917319 1.155127 -1.197418
H  2.643468 1.435576 0.397287
C  0.455178 1.323709 0.40014
C  -0.691009 1.282039 -0.358593
H  0.541946 -1.247483 -1.452347
H  -1.917297 -1.1457 -1.200654
H  0.002499 -0.000942 0.113958
H  -0.553967 1.284081 -1.443559
H  -2.852067 1.011538 -0.476393
H  0.346666 1.336293 1.487629
H  -0.345871 -1.371248 1.480247
totalener: -311.07375808 hartree
nucrepener: 382.86013937 hartree
electener: -693.93389746 hartree
oneelecener: -1165.58861908 hartree
twoeener: 471.65472162 hartree
kineticenergy: 309.66606782 hartree
exchangeener: -13.659881468117 hartree
correlationener: -0.927739277075 hartree
xcener: -14.587620745192 hartree
chargesum: 1.0000000
charge: -0.254811 0.173610 -0.261603 0.187031 -0.066550 -0.050076 -0.254338 0.173160 0.186462 -0.261046 0.170347 0.186877 -0.067287 -0.050802 0.183908 0.170639 0.081141 0.185200 0.186442 0.190355 0.191341
charge: 0.108351 -0.003233 0.112513 0.001376 0.131972 0.149556 0.108413 -0.003314 0.002180 0.112546 -0.004042 0.001241 0.130315 0.150938 0.003370 -0.003976 -0.011233 0.002736 0.002237 0.004301 0.003751
qa: -0.2548 0.1736 -0.2616 0.1870 -0.0666 -0.0501 -0.2543 0.1732 0.1865 -0.2610 0.1703 0.1869 -0.0673 -0.0508 0.1839 0.1706 0.0811 0.1852 0.1864 0.1904 0.1913
va: 3.8965 0.9808 3.9084 0.9736 3.7980 3.8056 3.8962 0.9811 0.9736 3.9085 0.9824 0.9738 3.7998 3.8048 0.9828 0.9822 1.1491 0.9820 0.9736 0.9819 0.9813
dispcorr: -0.011988142 hartree
energy: -311.791002114638
dipole: -0.00382 -0.00184 -0.00566 0.00164 -0.00348 -0.00183 -0.07127 0.06014 -0.01114
magnitude: 0.01263 au
magnitude: 0.03210 debye
