program: Orca
programVersion: 5.0.3
elementType: C H C H C C C H H C H H C C H H H H H H H
charge: 1
multiplicity: 1
keywords: DSD-PBEP86 def2-TZVP D3BJ RIJCOSX verytightscf def2-TZVP/C def2/J soscf noTRAH
formula: C8H13
InChI: InChI=1/C8H13/c1-2-4-6-8-7-5-3-1/h1-2,7H,3-6,8H2
21 atoms
C  -1.999366 0.759537 0.069766
H  -2.161951 0.828418 1.148025
C  -1.72973 -0.968504 -0.159322
H  -2.618448 -1.319428 0.369382
C  -0.415584 -1.387202 0.392263
C  0.685547 -1.275468 -0.378849
C  2.000817 -0.692747 0.062737
H  2.20832 -0.891782 1.119691
H  2.855559 -1.034645 -0.526958
C  1.788637 0.855035 -0.139386
H  1.828645 1.116513 -1.202496
H  2.592399 1.404273 0.357939
C  0.422172 1.264708 0.490723
C  -0.767738 1.299402 -0.371573
H  0.520807 -1.199802 -1.458405
H  -1.833248 -1.128188 -1.233001
H  0.193851 0.60682 1.3345
H  -0.659345 1.599145 -1.417608
H  -2.882934 0.993179 -0.522485
H  0.474789 2.267894 0.964205
H  -0.333752 -1.485087 1.4742
totalener: -311.10523689 hartree
nucrepener: 379.43143681 hartree
electener: -690.53667370 hartree
oneelecener: -1159.29617501 hartree
twoeener: 468.75950131 hartree
kineticenergy: 310.01121915 hartree
exchangeener: -13.665159439406 hartree
correlationener: -0.921579438362 hartree
xcener: -14.586738877767 hartree
chargesum: 1.0000000
charge: -0.275401 0.200314 -0.195033 0.193417 -0.211042 -0.104894 -0.213939 0.154350 0.165204 -0.270732 0.152366 0.168880 -0.147623 0.106976 0.139894 0.187105 0.149482 0.214876 0.195841 0.216185 0.173773
charge: -0.166418 0.168692 -0.110956 0.157915 -0.188601 -0.119390 -0.214469 0.148296 0.147692 -0.201778 0.141654 0.150172 -0.209314 0.147650 0.151054 0.152564 0.171820 0.173620 0.157498 0.193847 0.148453
qa: -0.2754 0.2003 -0.1950 0.1934 -0.2110 -0.1049 -0.2139 0.1543 0.1652 -0.2707 0.1524 0.1689 -0.1476 0.1070 0.1399 0.1871 0.1495 0.2149 0.1958 0.2162 0.1738
va: 3.8764 0.9579 3.8297 0.9571 3.8442 3.8504 3.8714 0.9724 0.9737 3.9062 0.9693 0.9681 3.7697 3.5452 0.9685 0.9588 0.9986 0.9452 0.9652 0.9439 0.9633
total: -311.778529199 hartree
dispcorr: -0.011897462 hartree
energy: -311.790426660835
dipole: 0.17293 -1.08088 -0.90795 1.64566 -0.41608 1.22958 0.38114 -0.55919 -0.17805
magnitude: 1.53881 au
magnitude: 3.91135 debye
