program: Orca
programVersion: 5.0.3
elementType: C H C H C C C H H C H H C C H H H H H H H
charge: 1
multiplicity: 1
keywords: DSD-PBEP86 def2-TZVP D3BJ RIJCOSX verytightscf def2-TZVP/C def2/J soscf noTRAH
formula: C8H13
InChI: InChI=1/C8H13/c1-2-4-6-8-7-5-3-1/h1-2,7H,3-6,8H2
21 atoms
C  -1.995967 0.535077 0.119647
H  -2.172473 0.725128 1.181986
C  -1.939149 -0.991995 -0.172408
H  -2.674167 -1.57969 0.3806
C  -0.507723 -1.166117 0.289423
C  0.615254 -1.141092 -0.497458
C  1.909629 -0.658405 0.067557
H  2.01632 -0.951618 1.117353
H  2.769241 -1.043285 -0.488166
C  1.883066 0.90487 -0.0442
H  1.993525 1.1912 -1.096864
H  2.733336 1.332326 0.493927
C  0.550293 1.481117 0.495134
C  -0.565357 0.873116 -0.273511
H  0.532917 -1.3058 -1.571456
H  -2.045514 -1.195955 -1.242148
H  0.429373 1.33886 1.573688
H  -0.433015 0.937214 -1.356526
H  -2.733235 1.085574 -0.474388
H  0.544408 2.567662 0.304009
H  -0.359879 -1.117185 1.369706
totalener: -311.15063536 hartree
nucrepener: 384.62672897 hartree
electener: -695.77736433 hartree
oneelecener: -1169.54795563 hartree
twoeener: 473.77059130 hartree
kineticenergy: 310.02418308 hartree
exchangeener: -13.673417823207 hartree
correlationener: -0.925809303607 hartree
xcener: -14.599227126814 hartree
chargesum: 1.0000000
charge: -0.203499 0.164961 -0.200250 0.177746 -0.088854 -0.083893 -0.223024 0.157530 0.174378 -0.234895 0.150828 0.173596 -0.203056 -0.000557 0.196991 0.160083 0.153617 0.189106 0.176927 0.185891 0.176374
charge: -0.194530 0.153680 -0.189274 0.149658 -0.063170 -0.043813 -0.208931 0.153543 0.156284 -0.205936 0.146124 0.150476 -0.223414 0.080935 0.162697 0.152226 0.152840 0.171422 0.153587 0.177788 0.167808
qa: -0.2035 0.1650 -0.2002 0.1777 -0.0889 -0.0839 -0.2230 0.1575 0.1744 -0.2349 0.1508 0.1736 -0.2031 -0.0006 0.1970 0.1601 0.1536 0.1891 0.1769 0.1859 0.1764
va: 3.8646 0.9730 3.8629 0.9718 3.8490 3.8258 3.9035 0.9695 0.9690 3.8677 0.9717 0.9660 3.9158 3.6742 0.9504 0.9742 0.9724 0.9516 0.9705 0.9639 0.9613
total: -311.824459001 hartree
dispcorr: -0.011784021 hartree
energy: -311.836243022215
dipole: 0.56306 -0.81981 -0.25675 1.85757 -1.58112 0.27645 0.17950 -0.35685 -0.17735
magnitude: 0.41689 au
magnitude: 1.05966 debye
