program: Orca
programVersion: 5.0.3
elementType: C H C H C C C H H C H H C C H H H H H H H
charge: 1
multiplicity: 1
keywords: DSD-PBEP86/2013 cc-pVTZ EnGrad RIJCOSX verytightscf cc-pVTZ/C def2/J soscf
formula: C8H13
InChI: InChI=1/C8H13/c1-2-4-6-8-7-5-3-1/h1-2,7H,3-6,8H2
21 atoms
C  -1.994473 0.540228 0.117958
H  -2.170257 0.72845 1.180887
C  -1.924098 -0.987495 -0.173652
H  -2.672393 -1.56923 0.368458
C  -0.498485 -1.189205 0.296911
C  0.619555 -1.156466 -0.491149
C  1.912249 -0.664121 0.069294
H  2.025566 -0.950893 1.120178
H  2.775094 -1.041927 -0.48669
C  1.873076 0.89736 -0.051825
H  1.970783 1.178588 -1.107215
H  2.724583 1.336516 0.475039
C  0.54327 1.478854 0.499424
C  -0.580879 0.916959 -0.282132
H  0.533579 -1.308472 -1.566842
H  -2.022688 -1.188092 -1.244943
H  0.418277 1.316486 1.574441
H  -0.445647 0.990663 -1.36431
H  -2.747367 1.072922 -0.473464
H  0.562109 2.570046 0.330664
H  -0.352809 -1.14516 1.377821
totalener: -311.17089382 hartree
nucrepener: 383.88246377 hartree
electener: -695.05335759 hartree
oneelecener: -1168.04160219 hartree
twoeener: 472.98824460 hartree
kineticenergy: 309.72922156 hartree
exchangeener: -12.757442974403 hartree
correlationener: -0.946448109215 hartree
xcener: -13.703891083618 hartree
chargesum: 1.0000000
charge: -0.227549 0.172396 -0.232888 0.184985 -0.081823 -0.099881 -0.250815 0.165913 0.183852 -0.251292 0.159744 0.184122 -0.237263 -0.030957 0.222560 0.168191 0.169937 0.213129 0.185499 0.203910 0.198229
charge: 0.089409 0.001487 0.093964 -0.000135 0.125821 0.134477 0.076721 0.000759 0.006603 0.098336 -0.005916 0.000088 0.063714 0.272617 -0.002931 0.000588 0.001033 0.005252 0.004719 0.030189 0.003207
qa: -0.2275 0.1724 -0.2329 0.1850 -0.0818 -0.0999 -0.2508 0.1659 0.1839 -0.2513 0.1597 0.1841 -0.2373 -0.0310 0.2226 0.1682 0.1699 0.2131 0.1855 0.2039 0.1982
va: 3.8677 0.9837 3.8884 0.9756 3.8134 3.8144 3.9210 0.9839 0.9759 3.8905 0.9813 0.9715 3.9049 3.6907 0.9618 0.9860 0.9824 0.9688 0.9744 0.9657 0.9770
energy: -311.873963525455
dipole: 0.56118 -0.79859 -0.23741 1.86270 -1.54612 0.31657 0.17228 -0.31136 -0.13908
magnitude: 0.41944 au
magnitude: 1.06612 debye
