program: Orca
programVersion: 5.0.3
elementType: C H C H C C C H H C H H C C H H H H H H H
charge: 1
multiplicity: 1
keywords: PBE0 cc-pVTZ EnGrad RIJCOSX verytightscf cc-pVTZ/C def2/J soscf
formula: C8H13
InChI: InChI=1/C8H13/c1-2-4-6-8-7-5-3-1/h1-2,7H,3-6,8H2
21 atoms
C  -2.002287 0.748589 0.069263
H  -2.165995 0.812579 1.147735
C  -1.731773 -0.975169 -0.165306
H  -2.619813 -1.337002 0.357393
C  -0.411445 -1.385725 0.387881
C  0.681712 -1.271167 -0.387058
C  1.996368 -0.699275 0.062917
H  2.199941 -0.908185 1.118588
H  2.853174 -1.036974 -0.526831
C  1.788007 0.84059 -0.133147
H  1.821748 1.104525 -1.196024
H  2.593044 1.391331 0.360572
C  0.425747 1.289644 0.496447
C  -0.765642 1.290842 -0.358668
H  0.516923 -1.190542 -1.466208
H  -1.829139 -1.135363 -1.239803
H  0.219422 0.741716 1.419163
H  -0.658899 1.633695 -1.391646
H  -2.881602 0.99802 -0.523273
H  0.51051 2.35537 0.805363
H  -0.325572 -1.472508 1.470219
totalener: -312.03566584 hartree
nucrepener: 379.16040477 hartree
electener: -691.19607061 hartree
oneelecener: -1159.35845492 hartree
twoeener: 468.16238431 hartree
kineticenergy: 309.65158393 hartree
exchangeener: -34.147876808303 hartree
correlationener: -1.959940167668 hartree
xcener: -36.107816975971 hartree
chargesum: 1.0000000
charge: -0.204099 0.177476 -0.178755 0.172275 -0.152799 -0.101610 -0.171235 0.135033 0.146863 -0.198659 0.136510 0.150366 -0.195805 0.102428 0.139695 0.167520 0.145938 0.205523 0.177768 0.186623 0.158945
charge: 0.131836 0.014544 0.173221 0.006207 0.020092 0.064360 0.071569 -0.002487 -0.000982 0.106001 -0.009512 0.000286 0.080309 0.300187 -0.015412 -0.000691 0.008186 0.018629 0.005928 0.049824 -0.022094
qa: -0.2041 0.1775 -0.1788 0.1723 -0.1528 -0.1016 -0.1712 0.1350 0.1469 -0.1987 0.1365 0.1504 -0.1958 0.1024 0.1397 0.1675 0.1459 0.2055 0.1778 0.1866 0.1589
va: 3.8547 0.9815 3.8777 0.9784 3.8095 3.8348 3.8821 0.9949 0.9888 3.8700 0.9925 0.9857 3.8944 3.5706 0.9944 0.9829 1.0036 0.9728 0.9843 0.9774 0.9934
energy: -312.035665844528
dipole: 0.21888 -1.05340 -0.83452 1.83229 -0.65172 1.18057 0.31390 -0.44051 -0.12661
magnitude: 1.45128 au
magnitude: 3.68885 debye
