program: Orca
programVersion: 5.0.3
elementType: C H C H C C C H H C H H C C H H H H H H H
charge: 1
multiplicity: 1
keywords: DSD-PBEP86 def2-TZVP RIJCOSX verytightscf def2-TZVP/C def2/J soscf noTRAH
formula: C8H13
InChI: InChI=1/C8H13/c1-2-4-6-8-7-5-3-1/h1-2,7H,3-6,8H2
21 atoms
C  -1.996704 0.532596 0.120007
H  -2.173758 0.723856 1.18198
C  -1.946693 -0.994356 -0.171541
H  -2.674962 -1.584656 0.387249
C  -0.512365 -1.154205 0.285966
C  0.613024 -1.133165 -0.500426
C  1.908489 -0.655441 0.066457
H  2.012124 -0.951945 1.115629
H  2.766164 -1.043977 -0.48953
C  1.888343 0.908652 -0.040395
H  2.005624 1.197804 -1.091488
H  2.737528 1.33018 0.50399
C  0.553603 1.481539 0.492915
C  -0.557641 0.851109 -0.269131
H  0.532133 -1.303606 -1.573597
H  -2.05699 -1.200573 -1.240358
H  0.434758 1.348633 1.572998
H  -0.427801 0.913687 -1.352502
H  -2.725754 1.091561 -0.475827
H  0.535185 2.565455 0.291178
H  -0.363521 -1.103872 1.365964
totalener: -311.17945081 hartree
nucrepener: 385.01024815 hartree
electener: -696.18969896 hartree
oneelecener: -1170.30112636 hartree
twoeener: 474.11142740 hartree
kineticenergy: 310.01185117 hartree
exchangeener: -12.762415550029 hartree
correlationener: -0.947835343686 hartree
xcener: -13.710250893715 hartree
chargesum: 1.0000000
charge: -0.203942 0.165536 -0.200958 0.178712 -0.087793 -0.076918 -0.225056 0.158831 0.175991 -0.237125 0.152055 0.174437 -0.206491 -0.010637 0.200175 0.160833 0.153625 0.187831 0.177198 0.185094 0.178601
charge: -0.193559 0.153474 -0.188104 0.149634 -0.062425 -0.035291 -0.207903 0.153945 0.156516 -0.206427 0.146223 0.150540 -0.223881 0.069314 0.163610 0.152218 0.152453 0.171496 0.152765 0.176220 0.169181
qa: -0.2039 0.1655 -0.2010 0.1787 -0.0878 -0.0769 -0.2251 0.1588 0.1760 -0.2371 0.1521 0.1744 -0.2065 -0.0106 0.2002 0.1608 0.1536 0.1878 0.1772 0.1851 0.1786
va: 3.8655 0.9732 3.8647 0.9719 3.8489 3.8178 3.9038 0.9691 0.9687 3.8688 0.9716 0.9662 3.9172 3.6862 0.9489 0.9740 0.9723 0.9526 0.9706 0.9644 0.9606
total: -311.863878437 hartree
energy: -311.863878436957
dipole: 0.56296 -0.79706 -0.23411 1.85581 -1.64311 0.21269 0.18322 -0.36475 -0.18153
magnitude: 0.36469 au
magnitude: 0.92696 debye
